{"text_format":"1","workbook":"xlsx","n_sheets":7,"sheets":["5 exo différents","5 exo différents (double)","5 exo différents (triple)","5 exo différents (quadruple)","5 exos identiques","5 exos différents type mélangé","5 exos différents type méla (2)"],"not_rendered":{"charts":0,"images":0,"macros":1,"external_links":0,"defined_names":7,"comments":0,"pivot_tables":0},"unopened":[],"bounds":{"document_bytes":16777216,"sheet_cells":100000,"rows_first":2000,"rows_last":500,"rows_between":2000,"halvings":0,"cell_chars":16384,"cell_head_chars":4096},"cells_cut":0,"cells_raw":0,"read":"whole","date_system":"1900"}

{"sheet":"5 exo différents","index":0,"n_rows":44,"n_cols":14,"rows_kept":44,"cut":false,"hidden":false,"merged":[[19,8,19,9],[0,0,0,7],[0,8,0,17],[28,0,28,3],[28,8,28,9],[37,0,37,3],[37,8,37,9],[1,12,1,13],[10,12,10,13],[19,12,19,13],[28,12,28,13],[37,12,37,13],[1,0,1,3],[1,8,1,9],[10,0,10,3],[10,8,10,9],[19,0,19,3]]}
["SAVOIR UTILISER LES MOTS  MOITIE / DOUBLE - TIERS / TRIPLE - QUART / QUADRUPLE",null,null,null,null,null,null,null,"Ne modifier que les cellules en violet en faisant attention à ce que la borne inf soit inférieure à la borne sup."]
["A. Complète :",null,null,null,null,null,null,null,"Bornes",null,null,null,"Bornes"]
[null,null,null,null,null,null,null,null,"inf","sup",null,null,"inf","sup"]
["a) ",{"$f":"CHOOSE(INT(RAND()*3)+1,\"Quelle est la moitié de \",\"Quel est le tiers de \",\"Quel est le quart de \") & (RANDBETWEEN(I4,J4)*12) & \" ? \"","v":"Quel est le tiers de 24 ? "},"→","…………………","f) ",{"$f":"CHOOSE(INT(RAND()*3)+1,\"Quelle est la moitié de \",\"Quel est le tiers de \",\"Quel est le quart de \") & (RANDBETWEEN(M4,N4)*12) & \" ? \"","v":"Quel est le quart de 108 ? "},{"$f":"C4","v":"→"},"…………………",1,2,null,null,9,10]
["b) ",{"$f":"CHOOSE(INT(RAND()*3)+1,\"Quelle est la moitié de \",\"Quel est le tiers de \",\"Quel est le quart de \") & (RANDBETWEEN(I5,J5)*12) & \" ? \"","v":"Quel est le quart de 48 ? "},"→","…………………","g) ",{"$f":"CHOOSE(INT(RAND()*3)+1,\"Quelle est la moitié de \",\"Quel est le tiers de \",\"Quel est le quart de \") & (RANDBETWEEN(M5,N5)*12) & \" ? \"","v":"Quel est le tiers de 96 ? "},{"$f":"C5","v":"→"},"…………………",3,4,null,null,7,8]
["c) ",{"$f":"CHOOSE(INT(RAND()*3)+1,\"Quelle est la moitié de \",\"Quel est le tiers de \",\"Quel est le quart de \") & (RANDBETWEEN(I6,J6)*12) & \" ? \"","v":"Quel est le tiers de 60 ? "},"→","…………………","h) ","Quel est le quart de 72 ? ","→","…………………",5,6,null,null,6,7]
["d) ",{"$f":"CHOOSE(INT(RAND()*3)+1,\"Quelle est la moitié de \",\"Quel est le tiers de \",\"Quel est le quart de \") & (RANDBETWEEN(I7,J7)*12) & \" ? \"","v":"Quelle est la moitié de 96 ? "},"→","…………………","i) ","Quelle est la moitié de 60 ? ","→","…………………",7,8,null,null,5,6]
["e) ",{"$f":"CHOOSE(INT(RAND()*3)+1,\"Quelle est la moitié de \",\"Quel est le tiers de \",\"Quel est le quart de \") & (RANDBETWEEN(I8,J8)*12) & \" ? \"","v":"Quel est le tiers de 108 ? "},"→","…………………","j) ","Quel est le tiers de 60 ? ","→","…………………",9,10,null,null,4,5]
[]
[]
["B. Complète :",null,null,null,null,null,null,null,"Bornes",null,null,null,"Bornes"]
[null,null,null,null,null,null,null,null,"inf","sup",null,null,"inf","sup"]
[{"$f":"A4","v":"a) "},{"$f":"CHOOSE(INT(RAND()*3)+1,\"Quel est le double de \",\"Quel est le triple de \",\"Quel est le quadruple de \") & (RANDBETWEEN(I13,J13)*12) & \" ? \"","v":"Quel est le triple de 24 ? "},"→","…………………",{"$f":"E4","v":"f) "},{"$f":"CHOOSE(INT(RAND()*3)+1,\"Quel est le double de \",\"Quel est le triple de \",\"Quel est le quadruple de \") & (RANDBETWEEN(M13,N13)*12) & \" ? \"","v":"Quel est le triple de 120 ? "},{"$f":"C13","v":"→"},"…………………",1,2,null,null,9,10]
["b) ",{"$f":"CHOOSE(INT(RAND()*3)+1,\"Quel est le double de \",\"Quel est le triple de \",\"Quel est le quadruple de \") & (RANDBETWEEN(I14,J14)*12) & \" ? \"","v":"Quel est le triple de 36 ? "},"→","…………………","g) ",{"$f":"CHOOSE(INT(RAND()*3)+1,\"Quel est le double de \",\"Quel est le triple de \",\"Quel est le quadruple de \") & (RANDBETWEEN(M14,N14)*12) & \" ? \"","v":"Quel est le quadruple de 84 ? "},{"$f":"C14","v":"→"},"…………………",3,4,null,null,7,8]
["c) ",{"$f":"CHOOSE(INT(RAND()*3)+1,\"Quel est le double de \",\"Quel est le triple de \",\"Quel est le quadruple de \") & (RANDBETWEEN(I15,J15)*12) & \" ? \"","v":"Quel est le triple de 60 ? "},"→","…………………","h) ",{"$f":"CHOOSE(INT(RAND()*3)+1,\"Quel est le double de \",\"Quel est le triple de \",\"Quel est le quadruple de \") & (RANDBETWEEN(M15,N15)*12) & \" ? \"","v":"Quel est le double de 72 ? "},"→","…………………",5,6,null,null,6,7]
["d) ",{"$f":"CHOOSE(INT(RAND()*3)+1,\"Quel est le double de \",\"Quel est le triple de \",\"Quel est le quadruple de \") & (RANDBETWEEN(I16,J16)*12) & \" ? \"","v":"Quel est le double de 84 ? "},"→","…………………","i) ",{"$f":"CHOOSE(INT(RAND()*3)+1,\"Quel est le double de \",\"Quel est le triple de \",\"Quel est le quadruple de \") & (RANDBETWEEN(M16,N16)*12) & \" ? \"","v":"Quel est le double de 60 ? "},"→","…………………",7,8,null,null,5,6]
["e) ",{"$f":"CHOOSE(INT(RAND()*3)+1,\"Quel est le double de \",\"Quel est le triple de \",\"Quel est le quadruple de \") & (RANDBETWEEN(I17,J17)*12) & \" ? \"","v":"Quel est le triple de 108 ? "},"→","…………………","j) ",{"$f":"CHOOSE(INT(RAND()*3)+1,\"Quel est le double de \",\"Quel est le triple de \",\"Quel est le quadruple de \") & (RANDBETWEEN(M17,N17)*12) & \" ? \"","v":"Quel est le quadruple de 48 ? "},"→","…………………",9,10,null,null,4,5]
[]
[]
["C. Complète :",null,null,null,null,null,null,null,"Bornes",null,null,null,"Bornes"]
[null,null,null,null,null,null,null,null,"inf","sup",null,null,"inf","sup"]
[{"$f":"A4","v":"a) "},{"$f":" (RANDBETWEEN(I22,J22)*12) & CHOOSE(INT(RAND()*3)+1,\" est la moitié de ?  \",\" est le tiers de ?  \",\" est le quart de ?  \")","v":"24 est le tiers de ?  "},"→","…………………",{"$f":"E4","v":"f) "},{"$f":" (RANDBETWEEN(M22,N22)*12) & CHOOSE(INT(RAND()*3)+1,\" est la moitié de ?  \",\" est le tiers de ?  \",\" est le quart de ?  \")","v":"120 est le tiers de ?  "},{"$f":"C22","v":"→"},"…………………",1,2,null,null,9,10]
["b) ",{"$f":" (RANDBETWEEN(I23,J23)*12) & CHOOSE(INT(RAND()*3)+1,\" est la moitié de ?  \",\" est le tiers de ?  \",\" est le quart de ?  \")","v":"36 est la moitié de ?  "},"→","…………………","g) ",{"$f":" (RANDBETWEEN(M23,N23)*12) & CHOOSE(INT(RAND()*3)+1,\" est la moitié de ?  \",\" est le tiers de ?  \",\" est le quart de ?  \")","v":"84 est le quart de ?  "},{"$f":"C23","v":"→"},"…………………",3,4,null,null,7,8]
["c) ",{"$f":" (RANDBETWEEN(I24,J24)*12) & CHOOSE(INT(RAND()*3)+1,\" est la moitié de ?  \",\" est le tiers de ?  \",\" est le quart de ?  \")","v":"60 est le tiers de ?  "},"→","…………………","h) ",{"$f":" (RANDBETWEEN(M24,N24)*12) & CHOOSE(INT(RAND()*3)+1,\" est la moitié de ?  \",\" est le tiers de ?  \",\" est le quart de ?  \")","v":"72 est le tiers de ?  "},"→","…………………",5,6,null,null,6,7]
["d) ",{"$f":" (RANDBETWEEN(I25,J25)*12) & CHOOSE(INT(RAND()*3)+1,\" est la moitié de ?  \",\" est le tiers de ?  \",\" est le quart de ?  \")","v":"96 est le tiers de ?  "},"→","…………………","i) ",{"$f":" (RANDBETWEEN(M25,N25)*12) & CHOOSE(INT(RAND()*3)+1,\" est la moitié de ?  \",\" est le tiers de ?  \",\" est le quart de ?  \")","v":"60 est le quart de ?  "},"→","…………………",7,8,null,null,5,6]
["e) ",{"$f":" (RANDBETWEEN(I26,J26)*12) & CHOOSE(INT(RAND()*3)+1,\" est la moitié de ?  \",\" est le tiers de ?  \",\" est le quart de ?  \")","v":"120 est le tiers de ?  "},"→","…………………","j) ",{"$f":" (RANDBETWEEN(M26,N26)*12) & CHOOSE(INT(RAND()*3)+1,\" est la moitié de ?  \",\" est le tiers de ?  \",\" est le quart de ?  \")","v":"60 est la moitié de ?  "},"→","…………………",9,10,null,null,4,5]
[]
[]
["D. Complète :",null,null,null,null,null,null,null,"Bornes",null,null,null,"Bornes"]
[null,null,null,null,null,null,null,null,"inf","sup",null,null,"inf","sup"]
[{"$f":"A4","v":"a) "},{"$f":" (RANDBETWEEN(I31,J31)*12) & CHOOSE(INT(RAND()*3)+1,\" est le double de ?  \",\" est le triple de ?  \",\" est le quadruple de ?  \")","v":"12 est le triple de ?  "},"→","…………………",{"$f":"E4","v":"f) "},{"$f":" (RANDBETWEEN(M31,N31)*12) & CHOOSE(INT(RAND()*3)+1,\" est le double de ?  \",\" est le triple de ?  \",\" est le quadruple de ?  \")","v":"108 est le double de ?  "},{"$f":"C31","v":"→"},"…………………",1,2,null,null,9,10]
["b) ",{"$f":" (RANDBETWEEN(I32,J32)*12) & CHOOSE(INT(RAND()*3)+1,\" est le double de ?  \",\" est le triple de ?  \",\" est le quadruple de ?  \")","v":"48 est le triple de ?  "},"→","…………………","g) ",{"$f":" (RANDBETWEEN(M32,N32)*12) & CHOOSE(INT(RAND()*3)+1,\" est le double de ?  \",\" est le triple de ?  \",\" est le quadruple de ?  \")","v":"96 est le triple de ?  "},{"$f":"C32","v":"→"},"…………………",3,4,null,null,7,8]
["c) ",{"$f":" (RANDBETWEEN(I33,J33)*12) & CHOOSE(INT(RAND()*3)+1,\" est le double de ?  \",\" est le triple de ?  \",\" est le quadruple de ?  \")","v":"60 est le triple de ?  "},"→","…………………","h) ",{"$f":" (RANDBETWEEN(M33,N33)*12) & CHOOSE(INT(RAND()*3)+1,\" est le double de ?  \",\" est le triple de ?  \",\" est le quadruple de ?  \")","v":"84 est le double de ?  "},"→","…………………",5,6,null,null,6,7]
["d) ",{"$f":" (RANDBETWEEN(I34,J34)*12) & CHOOSE(INT(RAND()*3)+1,\" est le double de ?  \",\" est le triple de ?  \",\" est le quadruple de ?  \")","v":"96 est le double de ?  "},"→","…………………","i) ",{"$f":" (RANDBETWEEN(M34,N34)*12) & CHOOSE(INT(RAND()*3)+1,\" est le double de ?  \",\" est le triple de ?  \",\" est le quadruple de ?  \")","v":"72 est le quadruple de ?  "},"→","…………………",7,8,null,null,5,6]
["e) ",{"$f":" (RANDBETWEEN(I35,J35)*12) & CHOOSE(INT(RAND()*3)+1,\" est le double de ?  \",\" est le triple de ?  \",\" est le quadruple de ?  \")","v":"120 est le double de ?  "},"→","…………………","j) ",{"$f":" (RANDBETWEEN(M35,N35)*12) & CHOOSE(INT(RAND()*3)+1,\" est le double de ?  \",\" est le triple de ?  \",\" est le quadruple de ?  \")","v":"48 est le quadruple de ?  "},"→","…………………",9,10,null,null,4,5]
[]
[]
["E. Complète :",null,null,null,null,null,null,null,"Bornes",null,null,null,"Bornes"]
[null,null,null,null,null,null,null,null,"inf","sup",null,null,"inf","sup"]
[{"$f":"A4","v":"a) "},{"$f":"CHOOSE(INT(RAND()*3)+1,\"Quelle est la moitié de \",\"Quel est le tiers de \",\"Quel est le quart de \") & (RANDBETWEEN(I40,J40)*12) & \" ? \"","v":"Quel est le quart de 12 ? "},"→","…………………",{"$f":"E4","v":"f) "},{"$f":"CHOOSE(INT(RAND()*3)+1,\"Quelle est la moitié de \",\"Quel est le tiers de \",\"Quel est le quart de \") & (RANDBETWEEN(M40,N40)*12) & \" ? \"","v":"Quelle est la moitié de 120 ? "},{"$f":"C40","v":"→"},"…………………",1,2,null,null,9,10]
["b) ",{"$f":"CHOOSE(INT(RAND()*3)+1,\"Quel est le double de \",\"Quel est le triple de \",\"Quel est le quadruple de \") & (RANDBETWEEN(I41,J41)*12) & \" ? \"","v":"Quel est le double de 48 ? "},"→","…………………","g) ",{"$f":"CHOOSE(INT(RAND()*3)+1,\"Quel est le double de \",\"Quel est le triple de \",\"Quel est le quadruple de \") & (RANDBETWEEN(M41,N41)*12) & \" ? \"","v":"Quel est le quadruple de 84 ? "},{"$f":"C41","v":"→"},"…………………",3,4,null,null,7,8]
["c) ",{"$f":" (RANDBETWEEN(I42,J42)*12) & CHOOSE(INT(RAND()*3)+1,\" est la moitié de ?  \",\" est le tiers de ?  \",\" est le quart de ?  \")","v":"72 est la moitié de ?  "},"→","…………………","h) ",{"$f":" (RANDBETWEEN(M42,N42)*12) & CHOOSE(INT(RAND()*3)+1,\" est la moitié de ?  \",\" est le tiers de ?  \",\" est le quart de ?  \")","v":"84 est la moitié de ?  "},"→","…………………",5,6,null,null,6,7]
["d) ",{"$f":" (RANDBETWEEN(I43,J43)*12) & CHOOSE(INT(RAND()*3)+1,\" est le double de ?  \",\" est le triple de ?  \",\" est le quadruple de ?  \")","v":"96 est le quadruple de ?  "},"→","…………………","i) ",{"$f":" (RANDBETWEEN(M43,N43)*12) & CHOOSE(INT(RAND()*3)+1,\" est le double de ?  \",\" est le triple de ?  \",\" est le quadruple de ?  \")","v":"72 est le double de ?  "},"→","…………………",7,8,null,null,5,6]
["e) ",{"$f":" (RANDBETWEEN(I44,J44)*12) & CHOOSE(INT(RAND()*3)+1,\" est le double de ?  \",\" est le triple de ?  \",\" est le quadruple de ?  \")","v":"108 est le quadruple de ?  "},"→","…………………","j) ",{"$f":" (RANDBETWEEN(M44,N44)*12) & CHOOSE(INT(RAND()*3)+1,\" est le double de ?  \",\" est le triple de ?  \",\" est le quadruple de ?  \")","v":"48 est le triple de ?  "},"→","…………………",9,10,null,null,4,5]

{"sheet":"5 exo différents (double)","index":1,"n_rows":44,"n_cols":14,"rows_kept":44,"cut":false,"hidden":false,"merged":[[10,0,10,3],[10,8,10,9],[10,12,10,13],[0,0,0,7],[0,8,0,17],[1,0,1,3],[1,8,1,9],[1,12,1,13],[37,0,37,3],[37,8,37,9],[37,12,37,13],[19,0,19,3],[19,8,19,9],[19,12,19,13],[28,0,28,3],[28,8,28,9],[28,12,28,13]]}
["SAVOIR UTILISER LES MOTS  MOITIE / DOUBLE",null,null,null,null,null,null,null,"Ne modifier que les cellules en violet en faisant attention à ce que la borne inf soit inférieure à la borne sup."]
["A. Complète :",null,null,null,null,null,null,null,"Bornes",null,null,null,"Bornes"]
[null,null,null,null,null,null,null,null,"inf","sup",null,null,"inf","sup"]
["a) ",{"$f":"CHOOSE(INT(RAND()*2)+1,\"Quelle est la moitié de \",\"Quel est le double de \") &TEXT( (RANDBETWEEN(I4,J4)*2),\"# ##0\") & \" ? \"","v":"Quel est le double de 4 ? "},"→","…………………","f) ",{"$f":"CHOOSE(INT(RAND()*2)+1,\"Quelle est la moitié de \",\"Quel est le double de \") &TEXT( (RANDBETWEEN(M4,N4)*2),\"# ##0\") & \" ? \"","v":"Quelle est la moitié de 20 ? "},{"$f":"C4","v":"→"},"…………………",1,2,null,null,9,10]
["b) ","Quelle est la moitié de 8 ? ","→","…………………","g) ","Quel est le double de 14 ? ",{"$f":"C5","v":"→"},"…………………",3,4,null,null,7,8]
["c) ","Quelle est la moitié de 12 ? ","→","…………………","h) ","Quel est le double de 14 ? ","→","…………………",5,6,null,null,6,7]
["d) ","Quel est le double de 14 ? ","→","…………………","i) ","Quel est le double de 10 ? ","→","…………………",7,8,null,null,5,6]
["e) ",{"$f":"CHOOSE(INT(RAND()*2)+1,\"Quelle est la moitié de \",\"Quel est le double de \") &TEXT( (RANDBETWEEN(I8,J8)*2),\"# ##0\") & \" ? \"","v":"Quel est le double de 20 ? "},"→","…………………","j) ",{"$f":"CHOOSE(INT(RAND()*2)+1,\"Quelle est la moitié de \",\"Quel est le double de \") &TEXT( (RANDBETWEEN(M8,N8)*2),\"# ##0\") & \" ? \"","v":"Quelle est la moitié de 10 ? "},"→","…………………",9,10,null,null,4,5]
[]
[]
["B. Complète :",null,null,null,null,null,null,null,"Bornes",null,null,null,"Bornes"]
[null,null,null,null,null,null,null,null,"inf","sup",null,null,"inf","sup"]
[{"$f":"A4","v":"a) "},{"$f":"CHOOSE(INT(RAND()*2)+1,\"Quelle est la moitié de \",\"Quel est le double de \") &TEXT( (RANDBETWEEN(I13,J13)*2),\"# ##0\") & \" ? \"","v":"Quel est le double de 6 ? "},"→","…………………",{"$f":"E4","v":"f) "},{"$f":"CHOOSE(INT(RAND()*2)+1,\"Quelle est la moitié de \",\"Quel est le double de \") &TEXT( (RANDBETWEEN(M13,N13)*2),\"# ##0\") & \" ? \"","v":"Quel est le double de 28 ? "},{"$f":"C13","v":"→"},"…………………",2,4,null,null,12,14]
["b) ","Quel est le double de 8 ? ","→","…………………","g) ","Quelle est la moitié de 30 ? ",{"$f":"C14","v":"→"},"…………………",4,6,null,null,14,16]
["c) ","Quel est le double de 14 ? ","→","…………………","h) ","Quelle est la moitié de 34 ? ","→","…………………",6,8,null,null,16,18]
["d) ","Quel est le double de 20 ? ","→","…………………","i) ","Quel est le double de 40 ? ","→","…………………",8,10,null,null,18,20]
["e) ",{"$f":"CHOOSE(INT(RAND()*2)+1,\"Quelle est la moitié de \",\"Quel est le double de \") &TEXT( (RANDBETWEEN(I17,J17)*2),\"# ##0\") & \" ? \"","v":"Quelle est la moitié de 22 ? "},"→","…………………","j) ",{"$f":"CHOOSE(INT(RAND()*2)+1,\"Quelle est la moitié de \",\"Quel est le double de \") &TEXT( (RANDBETWEEN(M17,N17)*2),\"# ##0\") & \" ? \"","v":"Quel est le double de 40 ? "},"→","…………………",10,12,null,null,20,22]
[]
[]
["C. Complète :",null,null,null,null,null,null,null,"Bornes",null,null,null,"Bornes"]
[null,null,null,null,null,null,null,null,"inf","sup",null,null,"inf","sup"]
[{"$f":"A4","v":"a) "},{"$f":"CHOOSE(INT(RAND()*2)+1,\"Quelle est la moitié de \",\"Quel est le double de \") &TEXT( (RANDBETWEEN(I22,J22)*2),\"# ##0\") & \" ? \"","v":"Quelle est la moitié de 40 ? "},"→","…………………",{"$f":"E4","v":"f) "},{"$f":"CHOOSE(INT(RAND()*2)+1,\"Quelle est la moitié de \",\"Quel est le double de \") &TEXT( (RANDBETWEEN(M22,N22)*2),\"# ##0\") & \" ? \"","v":"Quel est le double de 60 ? "},{"$f":"C22","v":"→"},"…………………",20,22,null,null,30,32]
["b) ","Quelle est la moitié de 46 ? ","→","…………………","g) ","Quel est le double de 64 ? ",{"$f":"C23","v":"→"},"…………………",22,24,null,null,32,34]
["c) ","Quel est le double de 52 ? ","→","…………………","h) ","Quel est le double de 68 ? ","→","…………………",24,26,null,null,34,36]
["d) ","Quel est le double de 56 ? ","→","…………………","i) ","Quel est le double de 76 ? ","→","…………………",26,28,null,null,36,38]
["e) ",{"$f":"CHOOSE(INT(RAND()*2)+1,\"Quelle est la moitié de \",\"Quel est le double de \") &TEXT( (RANDBETWEEN(I26,J26)*2),\"# ##0\") & \" ? \"","v":"Quel est le double de 56 ? "},"→","…………………","j) ",{"$f":"CHOOSE(INT(RAND()*2)+1,\"Quelle est la moitié de \",\"Quel est le double de \") &TEXT( (RANDBETWEEN(M26,N26)*2),\"# ##0\") & \" ? \"","v":"Quelle est la moitié de 78 ? "},"→","…………………",28,30,null,null,38,40]
[]
[]
["D. Complète :",null,null,null,null,null,null,null,"Bornes",null,null,null,"Bornes"]
[null,null,null,null,null,null,null,null,"inf","sup",null,null,"inf","sup"]
[{"$f":"A4","v":"a) "},{"$f":"CHOOSE(INT(RAND()*2)+1,\"Quelle est la moitié de \",\"Quel est le double de \") &TEXT( (RANDBETWEEN(I31,J31)*2),\"# ##0\") & \" ? \"","v":"Quel est le double de 82 ? "},"→","…………………",{"$f":"E4","v":"f) "},{"$f":"CHOOSE(INT(RAND()*2)+1,\"Quelle est la moitié de \",\"Quel est le double de \") &TEXT( (RANDBETWEEN(M31,N31)*2),\"# ##0\") & \" ? \"","v":"Quelle est la moitié de 104 ? "},{"$f":"C31","v":"→"},"…………………",40,42,null,null,50,52]
["b) ","Quelle est la moitié de 88 ? ","→","…………………","g) ","Quelle est la moitié de 108 ? ",{"$f":"C32","v":"→"},"…………………",42,44,null,null,52,54]
["c) ","Quelle est la moitié de 88 ? ","→","…………………","h) ","Quelle est la moitié de 108 ? ","→","…………………",44,46,null,null,54,56]
["d) ","Quel est le double de 94 ? ","→","…………………","i) ","Quelle est la moitié de 112 ? ","→","…………………",46,48,null,null,56,58]
["e) ",{"$f":"CHOOSE(INT(RAND()*2)+1,\"Quelle est la moitié de \",\"Quel est le double de \") &TEXT( (RANDBETWEEN(I35,J35)*2),\"# ##0\") & \" ? \"","v":"Quel est le double de 96 ? "},"→","…………………","j) ",{"$f":"CHOOSE(INT(RAND()*2)+1,\"Quelle est la moitié de \",\"Quel est le double de \") &TEXT( (RANDBETWEEN(M35,N35)*2),\"# ##0\") & \" ? \"","v":"Quelle est la moitié de 118 ? "},"→","…………………",48,50,null,null,58,60]
[]
[]
["E. Complète :",null,null,null,null,null,null,null,"Bornes",null,null,null,"Bornes"]
[null,null,null,null,null,null,null,null,"inf","sup",null,null,"inf","sup"]
[{"$f":"A4","v":"a) "},{"$f":"CHOOSE(INT(RAND()*2)+1,\"Quelle est la moitié de \",\"Quel est le double de \") &TEXT( (RANDBETWEEN(I40,J40)*2),\"# ##0\") & \" ? \"","v":"Quelle est la moitié de 600 ? "},"→","…………………",{"$f":"E4","v":"f) "},{"$f":"CHOOSE(INT(RAND()*2)+1,\"Quelle est la moitié de \",\"Quel est le double de \") &TEXT( (RANDBETWEEN(M40,N40)*2),\"# ##0\") & \" ? \"","v":"Quelle est la moitié de 382 ? "},{"$f":"C40","v":"→"},"…………………",222,300,null,null,100,200]
["b) ","Quel est le double de 732 ? ","→","…………………","g) ","Quel est le double de 430 ? ",{"$f":"C41","v":"→"},"…………………",300,400,null,null,200,300]
["c) ","Quel est le double de 902 ? ","→","…………………","h) ","Quelle est la moitié de 708 ? ","→","…………………",400,500,null,null,300,400]
["d) ","Quel est le double de 1 116 ? ","→","…………………","i) ","Quelle est la moitié de 988 ? ","→","…………………",500,600,null,null,400,500]
["e) ",{"$f":"CHOOSE(INT(RAND()*2)+1,\"Quelle est la moitié de \",\"Quel est le double de \") &TEXT( (RANDBETWEEN(I44,J44)*2),\"# ##0\") & \" ? \"","v":"Quelle est la moitié de 1 374 ? "},"→","…………………","j) ",{"$f":"CHOOSE(INT(RAND()*2)+1,\"Quelle est la moitié de \",\"Quel est le double de \") &TEXT( (RANDBETWEEN(M44,N44)*2),\"# ##0\") & \" ? \"","v":"Quelle est la moitié de 1 030 ? "},"→","…………………",600,700,null,null,500,600]

{"sheet":"5 exo différents (triple)","index":2,"n_rows":44,"n_cols":14,"rows_kept":44,"cut":false,"hidden":false,"merged":[[10,0,10,3],[10,8,10,9],[10,12,10,13],[0,0,0,7],[0,8,0,17],[1,0,1,3],[1,8,1,9],[1,12,1,13],[37,0,37,3],[37,8,37,9],[37,12,37,13],[19,0,19,3],[19,8,19,9],[19,12,19,13],[28,0,28,3],[28,8,28,9],[28,12,28,13]]}
["SAVOIR UTILISER LES MOTS  TIERS / TRIPLE",null,null,null,null,null,null,null,"Ne modifier que les cellules en violet en faisant attention à ce que la borne inf soit inférieure à la borne sup."]
["A. Complète :",null,null,null,null,null,null,null,"Bornes",null,null,null,"Bornes"]
[null,null,null,null,null,null,null,null,"inf","sup",null,null,"inf","sup"]
["a) ",{"$f":"CHOOSE(INT(RAND()*2)+1,\"Quel est le tiers de \",\"Quel est le triple de \") &TEXT( (RANDBETWEEN(I4,J4)*3),\"# ##0\") & \" ? \"","v":"Quel est le triple de 3 ? "},"→","…………………","f) ",{"$f":"CHOOSE(INT(RAND()*2)+1,\"Quel est le tiers de \",\"Quel est le triple de \") &TEXT( (RANDBETWEEN(M4,N4)*3),\"# ##0\") & \" ? \"","v":"Quel est le triple de 30 ? "},{"$f":"C4","v":"→"},"…………………",1,2,null,null,9,10]
["b) ",{"$f":"CHOOSE(INT(RAND()*2)+1,\"Quel est le tiers de \",\"Quel est le triple de \") &TEXT( (RANDBETWEEN(I5,J5)*3),\"# ##0\") & \" ? \"","v":"Quel est le triple de 12 ? "},"→","…………………","g) ",{"$f":"CHOOSE(INT(RAND()*2)+1,\"Quel est le tiers de \",\"Quel est le triple de \") &TEXT( (RANDBETWEEN(M5,N5)*3),\"# ##0\") & \" ? \"","v":"Quel est le tiers de 21 ? "},{"$f":"C5","v":"→"},"…………………",3,4,null,null,7,8]
["c) ","Quel est le tiers de 15 ? ","→","…………………","h) ","Quel est le triple de 21 ? ","→","…………………",5,6,null,null,6,7]
["d) ","Quel est le tiers de 21 ? ","→","…………………","i) ","Quel est le tiers de 15 ? ","→","…………………",7,8,null,null,5,6]
["e) ","Quel est le tiers de 30 ? ","→","…………………","j) ","Quel est le triple de 12 ? ","→","…………………",9,10,null,null,4,5]
[]
[]
["B. Complète :",null,null,null,null,null,null,null,"Bornes",null,null,null,"Bornes"]
[null,null,null,null,null,null,null,null,"inf","sup",null,null,"inf","sup"]
[{"$f":"A4","v":"a) "},{"$f":"CHOOSE(INT(RAND()*2)+1,\"Quel est le tiers de \",\"Quel est le triple de \") &TEXT( (RANDBETWEEN(I13,J13)*3),\"# ##0\") & \" ? \"","v":"Quel est le triple de 12 ? "},"→","…………………",{"$f":"E4","v":"f) "},{"$f":"CHOOSE(INT(RAND()*2)+1,\"Quel est le tiers de \",\"Quel est le triple de \") &TEXT( (RANDBETWEEN(M13,N13)*3),\"# ##0\") & \" ? \"","v":"Quel est le tiers de 36 ? "},{"$f":"C13","v":"→"},"…………………",2,4,null,null,12,14]
["b) ",{"$f":"CHOOSE(INT(RAND()*2)+1,\"Quel est le tiers de \",\"Quel est le triple de \") &TEXT( (RANDBETWEEN(I14,J14)*3),\"# ##0\") & \" ? \"","v":"Quel est le tiers de 15 ? "},"→","…………………","g) ",{"$f":"CHOOSE(INT(RAND()*2)+1,\"Quel est le tiers de \",\"Quel est le triple de \") &TEXT( (RANDBETWEEN(M14,N14)*3),\"# ##0\") & \" ? \"","v":"Quel est le tiers de 45 ? "},{"$f":"C14","v":"→"},"…………………",4,6,null,null,14,16]
["c) ","Quel est le triple de 24 ? ","→","…………………","h) ","Quel est le tiers de 51 ? ","→","…………………",6,8,null,null,16,18]
["d) ","Quel est le tiers de 30 ? ","→","…………………","i) ","Quel est le triple de 60 ? ","→","…………………",8,10,null,null,18,20]
["e) ","Quel est le tiers de 33 ? ","→","…………………","j) ","Quel est le triple de 66 ? ","→","…………………",10,12,null,null,20,22]
[]
[]
["C. Complète :",null,null,null,null,null,null,null,"Bornes",null,null,null,"Bornes"]
[null,null,null,null,null,null,null,null,"inf","sup",null,null,"inf","sup"]
[{"$f":"A4","v":"a) "},{"$f":"CHOOSE(INT(RAND()*2)+1,\"Quel est le tiers de \",\"Quel est le triple de \") &TEXT( (RANDBETWEEN(I22,J22)*3),\"# ##0\") & \" ? \"","v":"Quel est le triple de 60 ? "},"→","…………………",{"$f":"E4","v":"f) "},{"$f":"CHOOSE(INT(RAND()*2)+1,\"Quel est le tiers de \",\"Quel est le triple de \") &TEXT( (RANDBETWEEN(M22,N22)*3),\"# ##0\") & \" ? \"","v":"Quel est le tiers de 96 ? "},{"$f":"C22","v":"→"},"…………………",20,22,null,null,30,32]
["b) ",{"$f":"CHOOSE(INT(RAND()*2)+1,\"Quel est le tiers de \",\"Quel est le triple de \") &TEXT( (RANDBETWEEN(I23,J23)*3),\"# ##0\") & \" ? \"","v":"Quel est le tiers de 72 ? "},"→","…………………","g) ",{"$f":"CHOOSE(INT(RAND()*2)+1,\"Quel est le tiers de \",\"Quel est le triple de \") &TEXT( (RANDBETWEEN(M23,N23)*3),\"# ##0\") & \" ? \"","v":"Quel est le tiers de 102 ? "},{"$f":"C23","v":"→"},"…………………",22,24,null,null,32,34]
["c) ","Quel est le triple de 78 ? ","→","…………………","h) ","Quel est le tiers de 105 ? ","→","…………………",24,26,null,null,34,36]
["d) ","Quel est le tiers de 78 ? ","→","…………………","i) ","Quel est le triple de 108 ? ","→","…………………",26,28,null,null,36,38]
["e) ","Quel est le tiers de 84 ? ","→","…………………","j) ","Quel est le tiers de 120 ? ","→","…………………",28,30,null,null,38,40]
[]
[]
["D. Complète :",null,null,null,null,null,null,null,"Bornes",null,null,null,"Bornes"]
[null,null,null,null,null,null,null,null,"inf","sup",null,null,"inf","sup"]
[{"$f":"A4","v":"a) "},{"$f":"CHOOSE(INT(RAND()*2)+1,\"Quel est le tiers de \",\"Quel est le triple de \") &TEXT( (RANDBETWEEN(I31,J31)*3),\"# ##0\") & \" ? \"","v":"Quel est le tiers de 120 ? "},"→","…………………",{"$f":"E4","v":"f) "},{"$f":"CHOOSE(INT(RAND()*2)+1,\"Quel est le tiers de \",\"Quel est le triple de \") &TEXT( (RANDBETWEEN(M31,N31)*3),\"# ##0\") & \" ? \"","v":"Quel est le tiers de 150 ? "},{"$f":"C31","v":"→"},"…………………",40,42,null,null,50,52]
["b) ",{"$f":"CHOOSE(INT(RAND()*2)+1,\"Quel est le tiers de \",\"Quel est le triple de \") &TEXT( (RANDBETWEEN(I32,J32)*3),\"# ##0\") & \" ? \"","v":"Quel est le triple de 132 ? "},"→","…………………","g) ",{"$f":"CHOOSE(INT(RAND()*2)+1,\"Quel est le tiers de \",\"Quel est le triple de \") &TEXT( (RANDBETWEEN(M32,N32)*3),\"# ##0\") & \" ? \"","v":"Quel est le triple de 159 ? "},{"$f":"C32","v":"→"},"…………………",42,44,null,null,52,54]
["c) ","Quel est le tiers de 132 ? ","→","…………………","h) ","Quel est le tiers de 162 ? ","→","…………………",44,46,null,null,54,56]
["d) ","Quel est le tiers de 144 ? ","→","…………………","i) ","Quel est le tiers de 171 ? ","→","…………………",46,48,null,null,56,58]
["e) ","Quel est le triple de 150 ? ","→","…………………","j) ","Quel est le triple de 180 ? ","→","…………………",48,50,null,null,58,60]
[]
[]
["E. Complète :",null,null,null,null,null,null,null,"Bornes",null,null,null,"Bornes"]
[null,null,null,null,null,null,null,null,"inf","sup",null,null,"inf","sup"]
[{"$f":"A4","v":"a) "},{"$f":"CHOOSE(INT(RAND()*2)+1,\"Quel est le tiers de \",\"Quel est le triple de \") &TEXT( (RANDBETWEEN(I40,J40)*3),\"# ##0\") & \" ? \"","v":"Quel est le triple de 717 ? "},"→","…………………",{"$f":"E4","v":"f) "},{"$f":"CHOOSE(INT(RAND()*2)+1,\"Quel est le tiers de \",\"Quel est le triple de \") &TEXT( (RANDBETWEEN(M40,N40)*3),\"# ##0\") & \" ? \"","v":"Quel est le tiers de 360 ? "},{"$f":"C40","v":"→"},"…………………",222,300,null,null,100,200]
["b) ",{"$f":"CHOOSE(INT(RAND()*2)+1,\"Quel est le tiers de \",\"Quel est le triple de \") &TEXT( (RANDBETWEEN(I41,J41)*3),\"# ##0\") & \" ? \"","v":"Quel est le triple de 1 059 ? "},"→","…………………","g) ",{"$f":"CHOOSE(INT(RAND()*2)+1,\"Quel est le tiers de \",\"Quel est le triple de \") &TEXT( (RANDBETWEEN(M41,N41)*3),\"# ##0\") & \" ? \"","v":"Quel est le tiers de 900 ? "},{"$f":"C41","v":"→"},"…………………",300,400,null,null,200,300]
["c) ","Quel est le triple de 1 494 ? ","→","…………………","h) ","Quel est le tiers de 1 044 ? ","→","…………………",400,500,null,null,300,400]
["d) ","Quel est le tiers de 1 557 ? ","→","…………………","i) ","Quel est le tiers de 1 344 ? ","→","…………………",500,600,null,null,400,500]
["e) ","Quel est le triple de 1 917 ? ","→","…………………","j) ","Quel est le triple de 1 533 ? ","→","…………………",600,700,null,null,500,600]

{"sheet":"5 exo différents (quadruple)","index":3,"n_rows":44,"n_cols":14,"rows_kept":44,"cut":false,"hidden":false,"merged":[[37,0,37,3],[37,8,37,9],[37,12,37,13],[19,0,19,3],[19,8,19,9],[19,12,19,13],[28,0,28,3],[28,8,28,9],[28,12,28,13],[10,0,10,3],[10,8,10,9],[10,12,10,13],[0,0,0,7],[0,8,0,17],[1,0,1,3],[1,8,1,9],[1,12,1,13]]}
["SAVOIR UTILISER LES MOTS  QUART / QUADRUPLE",null,null,null,null,null,null,null,"Ne modifier que les cellules en violet en faisant attention à ce que la borne inf soit inférieure à la borne sup."]
["A. Complète :",null,null,null,null,null,null,null,"Bornes",null,null,null,"Bornes"]
[null,null,null,null,null,null,null,null,"inf","sup",null,null,"inf","sup"]
["a) ",{"$f":"CHOOSE(INT(RAND()*2)+1,\"Quel est le quart de \",\"Quel est le quadruple de \") &TEXT( (RANDBETWEEN(I4,J4)*4),\"# ##0\") & \" ? \"","v":"Quel est le quadruple de 8 ? "},"→","…………………","f) ",{"$f":"CHOOSE(INT(RAND()*2)+1,\"Quel est le quart de \",\"Quel est le quadruple de \") &TEXT( (RANDBETWEEN(M4,N4)*4),\"# ##0\") & \" ? \"","v":"Quel est le quadruple de 40 ? "},{"$f":"C4","v":"→"},"…………………",1,2,null,null,9,10]
["b) ",{"$f":"CHOOSE(INT(RAND()*2)+1,\"Quel est le quart de \",\"Quel est le quadruple de \") &TEXT( (RANDBETWEEN(I5,J5)*4),\"# ##0\") & \" ? \"","v":"Quel est le quart de 16 ? "},"→","…………………","g) ",{"$f":"CHOOSE(INT(RAND()*2)+1,\"Quel est le quart de \",\"Quel est le quadruple de \") &TEXT( (RANDBETWEEN(M5,N5)*4),\"# ##0\") & \" ? \"","v":"Quel est le quadruple de 28 ? "},{"$f":"C5","v":"→"},"…………………",3,4,null,null,7,8]
["c) ","Quel est le quart de 20 ? ","→","…………………","h) ","Quel est le quart de 28 ? ","→","…………………",5,6,null,null,6,7]
["d) ","Quel est le quart de 32 ? ","→","…………………","i) ","Quel est le quart de 24 ? ","→","…………………",7,8,null,null,5,6]
["e) ","Quel est le quart de 36 ? ","→","…………………","j) ","Quel est le quadruple de 20 ? ","→","…………………",9,10,null,null,4,5]
[]
[]
["B. Complète :",null,null,null,null,null,null,null,"Bornes",null,null,null,"Bornes"]
[null,null,null,null,null,null,null,null,"inf","sup",null,null,"inf","sup"]
[{"$f":"A4","v":"a) "},{"$f":"CHOOSE(INT(RAND()*2)+1,\"Quel est le quart de \",\"Quel est le quadruple de \") &TEXT( (RANDBETWEEN(I13,J13)*4),\"# ##0\") & \" ? \"","v":"Quel est le quart de 12 ? "},"→","…………………",{"$f":"E4","v":"f) "},{"$f":"CHOOSE(INT(RAND()*2)+1,\"Quel est le quart de \",\"Quel est le quadruple de \") &TEXT( (RANDBETWEEN(M13,N13)*4),\"# ##0\") & \" ? \"","v":"Quel est le quart de 48 ? "},{"$f":"C13","v":"→"},"…………………",2,4,null,null,12,14]
["b) ",{"$f":"CHOOSE(INT(RAND()*2)+1,\"Quel est le quart de \",\"Quel est le quadruple de \") &TEXT( (RANDBETWEEN(I14,J14)*4),\"# ##0\") & \" ? \"","v":"Quel est le quart de 16 ? "},"→","…………………","g) ",{"$f":"CHOOSE(INT(RAND()*2)+1,\"Quel est le quart de \",\"Quel est le quadruple de \") &TEXT( (RANDBETWEEN(M14,N14)*4),\"# ##0\") & \" ? \"","v":"Quel est le quart de 56 ? "},{"$f":"C14","v":"→"},"…………………",4,6,null,null,14,16]
["c) ","Quel est le quart de 28 ? ","→","…………………","h) ","Quel est le quart de 72 ? ","→","…………………",6,8,null,null,16,18]
["d) ","Quel est le quart de 32 ? ","→","…………………","i) ","Quel est le quart de 80 ? ","→","…………………",8,10,null,null,18,20]
["e) ","Quel est le quart de 40 ? ","→","…………………","j) ","Quel est le quadruple de 80 ? ","→","…………………",10,12,null,null,20,22]
[]
[]
["C. Complète :",null,null,null,null,null,null,null,"Bornes",null,null,null,"Bornes"]
[null,null,null,null,null,null,null,null,"inf","sup",null,null,"inf","sup"]
[{"$f":"A4","v":"a) "},{"$f":"CHOOSE(INT(RAND()*2)+1,\"Quel est le quart de \",\"Quel est le quadruple de \") &TEXT( (RANDBETWEEN(I22,J22)*4),\"# ##0\") & \" ? \"","v":"Quel est le quadruple de 88 ? "},"→","…………………",{"$f":"E4","v":"f) "},{"$f":"CHOOSE(INT(RAND()*2)+1,\"Quel est le quart de \",\"Quel est le quadruple de \") &TEXT( (RANDBETWEEN(M22,N22)*4),\"# ##0\") & \" ? \"","v":"Quel est le quart de 120 ? "},{"$f":"C22","v":"→"},"…………………",20,22,null,null,30,32]
["b) ",{"$f":"CHOOSE(INT(RAND()*2)+1,\"Quel est le quart de \",\"Quel est le quadruple de \") &TEXT( (RANDBETWEEN(I23,J23)*4),\"# ##0\") & \" ? \"","v":"Quel est le quadruple de 96 ? "},"→","…………………","g) ",{"$f":"CHOOSE(INT(RAND()*2)+1,\"Quel est le quart de \",\"Quel est le quadruple de \") &TEXT( (RANDBETWEEN(M23,N23)*4),\"# ##0\") & \" ? \"","v":"Quel est le quart de 128 ? "},{"$f":"C23","v":"→"},"…………………",22,24,null,null,32,34]
["c) ","Quel est le quart de 100 ? ","→","…………………","h) ","Quel est le quadruple de 136 ? ","→","…………………",24,26,null,null,34,36]
["d) ","Quel est le quart de 112 ? ","→","…………………","i) ","Quel est le quart de 144 ? ","→","…………………",26,28,null,null,36,38]
["e) ","Quel est le quadruple de 112 ? ","→","…………………","j) ","Quel est le quadruple de 156 ? ","→","…………………",28,30,null,null,38,40]
[]
[]
["D. Complète :",null,null,null,null,null,null,null,"Bornes",null,null,null,"Bornes"]
[null,null,null,null,null,null,null,null,"inf","sup",null,null,"inf","sup"]
[{"$f":"A4","v":"a) "},{"$f":"CHOOSE(INT(RAND()*2)+1,\"Quel est le quart de \",\"Quel est le quadruple de \") &TEXT( (RANDBETWEEN(I31,J31)*4),\"# ##0\") & \" ? \"","v":"Quel est le quadruple de 168 ? "},"→","…………………",{"$f":"E4","v":"f) "},{"$f":"CHOOSE(INT(RAND()*2)+1,\"Quel est le quart de \",\"Quel est le quadruple de \") &TEXT( (RANDBETWEEN(M31,N31)*4),\"# ##0\") & \" ? \"","v":"Quel est le quadruple de 204 ? "},{"$f":"C31","v":"→"},"…………………",40,42,null,null,50,52]
["b) ",{"$f":"CHOOSE(INT(RAND()*2)+1,\"Quel est le quart de \",\"Quel est le quadruple de \") &TEXT( (RANDBETWEEN(I32,J32)*4),\"# ##0\") & \" ? \"","v":"Quel est le quart de 172 ? "},"→","…………………","g) ",{"$f":"CHOOSE(INT(RAND()*2)+1,\"Quel est le quart de \",\"Quel est le quadruple de \") &TEXT( (RANDBETWEEN(M32,N32)*4),\"# ##0\") & \" ? \"","v":"Quel est le quadruple de 212 ? "},{"$f":"C32","v":"→"},"…………………",42,44,null,null,52,54]
["c) ","Quel est le quadruple de 184 ? ","→","…………………","h) ","Quel est le quart de 224 ? ","→","…………………",44,46,null,null,54,56]
["d) ","Quel est le quart de 192 ? ","→","…………………","i) ","Quel est le quadruple de 228 ? ","→","…………………",46,48,null,null,56,58]
["e) ","Quel est le quart de 192 ? ","→","…………………","j) ","Quel est le quart de 232 ? ","→","…………………",48,50,null,null,58,60]
[]
[]
["E. Complète :",null,null,null,null,null,null,null,"Bornes",null,null,null,"Bornes"]
[null,null,null,null,null,null,null,null,"inf","sup",null,null,"inf","sup"]
[{"$f":"A4","v":"a) "},{"$f":"CHOOSE(INT(RAND()*2)+1,\"Quel est le quart de \",\"Quel est le quadruple de \") &TEXT( (RANDBETWEEN(I40,J40)*4),\"# ##0\") & \" ? \"","v":"Quel est le quadruple de 252 ? "},"→","…………………",{"$f":"E4","v":"f) "},{"$f":"CHOOSE(INT(RAND()*2)+1,\"Quel est le quart de \",\"Quel est le quadruple de \") &TEXT( (RANDBETWEEN(M40,N40)*4),\"# ##0\") & \" ? \"","v":"Quel est le quart de 436 ? "},{"$f":"C40","v":"→"},"…………………",60,70,null,null,100,110]
["b) ",{"$f":"CHOOSE(INT(RAND()*2)+1,\"Quel est le quart de \",\"Quel est le quadruple de \") &TEXT( (RANDBETWEEN(I41,J41)*4),\"# ##0\") & \" ? \"","v":"Quel est le quadruple de 316 ? "},"→","…………………","g) ",{"$f":"CHOOSE(INT(RAND()*2)+1,\"Quel est le quart de \",\"Quel est le quadruple de \") &TEXT( (RANDBETWEEN(M41,N41)*4),\"# ##0\") & \" ? \"","v":"Quel est le quadruple de 376 ? "},{"$f":"C41","v":"→"},"…………………",70,80,null,null,90,100]
["c) ","Quel est le quadruple de 352 ? ","→","…………………","h) ","Quel est le quadruple de 200 ? ","→","…………………",80,90,null,null,45,58]
["d) ","Quel est le quadruple de 364 ? ","→","…………………","i) ","Quel est le quart de 224 ? ","→","…………………",90,100,null,null,43,65]
["e) ","Quel est le quadruple de 440 ? ","→","…………………","j) ","Quel est le quart de 500 ? ","→","…………………",100,110,null,null,125,150]

{"sheet":"5 exos identiques","index":4,"n_rows":44,"n_cols":14,"rows_kept":44,"cut":false,"hidden":false,"merged":[[10,0,10,3],[10,8,10,9],[10,12,10,13],[0,0,0,7],[0,8,0,17],[1,0,1,3],[1,8,1,9],[1,12,1,13],[37,0,37,3],[37,8,37,9],[37,12,37,13],[19,0,19,3],[19,8,19,9],[19,12,19,13],[28,0,28,3],[28,8,28,9],[28,12,28,13]]}
["SAVOIR UTILISER LES MOTS  MOITIE / DOUBLE - TIERS / TRIPLE - QUART / QUADRUPLE",null,null,null,null,null,null,null,"Ne modifier que les cellules en violet en faisant attention à ce que la borne inf soit inférieure à la borne sup."]
["Complète :",null,null,null,null,null,null,null,"Bornes",null,null,null,"Bornes"]
[null,null,null,null,null,null,null,null,"inf","sup",null,null,"inf","sup"]
[{"$f":"'5 exo différents'!A40","v":"a) "},{"$f":"'5 exo différents'!B40","v":"Quel est le quart de 12 ? "},{"$f":"'5 exo différents'!C40","v":"→"},{"$f":"'5 exo différents'!D40","v":"…………………"},{"$f":"'5 exo différents'!E40","v":"f) "},{"$f":"'5 exo différents'!F40","v":"Quelle est la moitié de 120 ? "},{"$f":"'5 exo différents'!G40","v":"→"},{"$f":"'5 exo différents'!H40","v":"…………………"},1,2,null,null,9,10]
[{"$f":"'5 exo différents'!A41","v":"b) "},{"$f":"'5 exo différents'!B41","v":"Quel est le double de 48 ? "},{"$f":"'5 exo différents'!C41","v":"→"},{"$f":"'5 exo différents'!D41","v":"…………………"},{"$f":"'5 exo différents'!E41","v":"g) "},{"$f":"'5 exo différents'!F41","v":"Quel est le quadruple de 84 ? "},{"$f":"'5 exo différents'!G41","v":"→"},{"$f":"'5 exo différents'!H41","v":"…………………"},3,4,null,null,7,8]
[{"$f":"'5 exo différents'!A42","v":"c) "},{"$f":"'5 exo différents'!B42","v":"72 est la moitié de ?  "},{"$f":"'5 exo différents'!C42","v":"→"},{"$f":"'5 exo différents'!D42","v":"…………………"},{"$f":"'5 exo différents'!E42","v":"h) "},{"$f":"'5 exo différents'!F42","v":"84 est la moitié de ?  "},{"$f":"'5 exo différents'!G42","v":"→"},{"$f":"'5 exo différents'!H42","v":"…………………"},5,6,null,null,6,7]
[{"$f":"'5 exo différents'!A43","v":"d) "},{"$f":"'5 exo différents'!B43","v":"96 est le quadruple de ?  "},{"$f":"'5 exo différents'!C43","v":"→"},{"$f":"'5 exo différents'!D43","v":"…………………"},{"$f":"'5 exo différents'!E43","v":"i) "},{"$f":"'5 exo différents'!F43","v":"72 est le double de ?  "},{"$f":"'5 exo différents'!G43","v":"→"},{"$f":"'5 exo différents'!H43","v":"…………………"},7,8,null,null,5,6]
[{"$f":"'5 exo différents'!A44","v":"e) "},{"$f":"'5 exo différents'!B44","v":"108 est le quadruple de ?  "},{"$f":"'5 exo différents'!C44","v":"→"},{"$f":"'5 exo différents'!D44","v":"…………………"},{"$f":"'5 exo différents'!E44","v":"j) "},{"$f":"'5 exo différents'!F44","v":"48 est le triple de ?  "},{"$f":"'5 exo différents'!G44","v":"→"},{"$f":"'5 exo différents'!H44","v":"…………………"},9,10,null,null,4,5]
[]
[]
[{"$f":"$A$2","v":"Complète :"},null,null,null,null,null,null,null,"Bornes",null,null,null,"Bornes"]
[null,null,null,null,null,null,null,null,"inf","sup",null,null,"inf","sup"]
[{"$f":"'5 exo différents'!A40","v":"a) "},{"$f":"'5 exo différents'!B40","v":"Quel est le quart de 12 ? "},{"$f":"'5 exo différents'!C40","v":"→"},{"$f":"'5 exo différents'!D40","v":"…………………"},{"$f":"'5 exo différents'!E40","v":"f) "},{"$f":"'5 exo différents'!F40","v":"Quelle est la moitié de 120 ? "},{"$f":"'5 exo différents'!G40","v":"→"},{"$f":"'5 exo différents'!H40","v":"…………………"},1,2,null,null,9,10]
[{"$f":"'5 exo différents'!A41","v":"b) "},{"$f":"'5 exo différents'!B41","v":"Quel est le double de 48 ? "},{"$f":"'5 exo différents'!C41","v":"→"},{"$f":"'5 exo différents'!D41","v":"…………………"},{"$f":"'5 exo différents'!E41","v":"g) "},{"$f":"'5 exo différents'!F41","v":"Quel est le quadruple de 84 ? "},{"$f":"'5 exo différents'!G41","v":"→"},{"$f":"'5 exo différents'!H41","v":"…………………"},3,4,null,null,7,8]
[{"$f":"'5 exo différents'!A42","v":"c) "},{"$f":"'5 exo différents'!B42","v":"72 est la moitié de ?  "},{"$f":"'5 exo différents'!C42","v":"→"},{"$f":"'5 exo différents'!D42","v":"…………………"},{"$f":"'5 exo différents'!E42","v":"h) "},{"$f":"'5 exo différents'!F42","v":"84 est la moitié de ?  "},{"$f":"'5 exo différents'!G42","v":"→"},{"$f":"'5 exo différents'!H42","v":"…………………"},5,6,null,null,6,7]
[{"$f":"'5 exo différents'!A43","v":"d) "},{"$f":"'5 exo différents'!B43","v":"96 est le quadruple de ?  "},{"$f":"'5 exo différents'!C43","v":"→"},{"$f":"'5 exo différents'!D43","v":"…………………"},{"$f":"'5 exo différents'!E43","v":"i) "},{"$f":"'5 exo différents'!F43","v":"72 est le double de ?  "},{"$f":"'5 exo différents'!G43","v":"→"},{"$f":"'5 exo différents'!H43","v":"…………………"},7,8,null,null,5,6]
[{"$f":"'5 exo différents'!A44","v":"e) "},{"$f":"'5 exo différents'!B44","v":"108 est le quadruple de ?  "},{"$f":"'5 exo différents'!C44","v":"→"},{"$f":"'5 exo différents'!D44","v":"…………………"},{"$f":"'5 exo différents'!E44","v":"j) "},{"$f":"'5 exo différents'!F44","v":"48 est le triple de ?  "},{"$f":"'5 exo différents'!G44","v":"→"},{"$f":"'5 exo différents'!H44","v":"…………………"},9,10,null,null,4,5]
[]
[]
["Complète :",null,null,null,null,null,null,null,"Bornes",null,null,null,"Bornes"]
[null,null,null,null,null,null,null,null,"inf","sup",null,null,"inf","sup"]
[{"$f":"'5 exo différents'!A40","v":"a) "},{"$f":"'5 exo différents'!B40","v":"Quel est le quart de 12 ? "},{"$f":"'5 exo différents'!C40","v":"→"},{"$f":"'5 exo différents'!D40","v":"…………………"},{"$f":"'5 exo différents'!E40","v":"f) "},{"$f":"'5 exo différents'!F40","v":"Quelle est la moitié de 120 ? "},{"$f":"'5 exo différents'!G40","v":"→"},{"$f":"'5 exo différents'!H40","v":"…………………"},1,2,null,null,9,10]
[{"$f":"'5 exo différents'!A41","v":"b) "},{"$f":"'5 exo différents'!B41","v":"Quel est le double de 48 ? "},{"$f":"'5 exo différents'!C41","v":"→"},{"$f":"'5 exo différents'!D41","v":"…………………"},{"$f":"'5 exo différents'!E41","v":"g) "},{"$f":"'5 exo différents'!F41","v":"Quel est le quadruple de 84 ? "},{"$f":"'5 exo différents'!G41","v":"→"},{"$f":"'5 exo différents'!H41","v":"…………………"},3,4,null,null,7,8]
[{"$f":"'5 exo différents'!A42","v":"c) "},{"$f":"'5 exo différents'!B42","v":"72 est la moitié de ?  "},{"$f":"'5 exo différents'!C42","v":"→"},{"$f":"'5 exo différents'!D42","v":"…………………"},{"$f":"'5 exo différents'!E42","v":"h) "},{"$f":"'5 exo différents'!F42","v":"84 est la moitié de ?  "},{"$f":"'5 exo différents'!G42","v":"→"},{"$f":"'5 exo différents'!H42","v":"…………………"},5,6,null,null,6,7]
[{"$f":"'5 exo différents'!A43","v":"d) "},{"$f":"'5 exo différents'!B43","v":"96 est le quadruple de ?  "},{"$f":"'5 exo différents'!C43","v":"→"},{"$f":"'5 exo différents'!D43","v":"…………………"},{"$f":"'5 exo différents'!E43","v":"i) "},{"$f":"'5 exo différents'!F43","v":"72 est le double de ?  "},{"$f":"'5 exo différents'!G43","v":"→"},{"$f":"'5 exo différents'!H43","v":"…………………"},7,8,null,null,5,6]
[{"$f":"'5 exo différents'!A44","v":"e) "},{"$f":"'5 exo différents'!B44","v":"108 est le quadruple de ?  "},{"$f":"'5 exo différents'!C44","v":"→"},{"$f":"'5 exo différents'!D44","v":"…………………"},{"$f":"'5 exo différents'!E44","v":"j) "},{"$f":"'5 exo différents'!F44","v":"48 est le triple de ?  "},{"$f":"'5 exo différents'!G44","v":"→"},{"$f":"'5 exo différents'!H44","v":"…………………"},9,10,null,null,4,5]
[]
[]
["Complète :",null,null,null,null,null,null,null,"Bornes",null,null,null,"Bornes"]
[null,null,null,null,null,null,null,null,"inf","sup",null,null,"inf","sup"]
[{"$f":"'5 exo différents'!A40","v":"a) "},{"$f":"'5 exo différents'!B40","v":"Quel est le quart de 12 ? "},{"$f":"'5 exo différents'!C40","v":"→"},{"$f":"'5 exo différents'!D40","v":"…………………"},{"$f":"'5 exo différents'!E40","v":"f) "},{"$f":"'5 exo différents'!F40","v":"Quelle est la moitié de 120 ? "},{"$f":"'5 exo différents'!G40","v":"→"},{"$f":"'5 exo différents'!H40","v":"…………………"},1,2,null,null,9,10]
[{"$f":"'5 exo différents'!A41","v":"b) "},{"$f":"'5 exo différents'!B41","v":"Quel est le double de 48 ? "},{"$f":"'5 exo différents'!C41","v":"→"},{"$f":"'5 exo différents'!D41","v":"…………………"},{"$f":"'5 exo différents'!E41","v":"g) "},{"$f":"'5 exo différents'!F41","v":"Quel est le quadruple de 84 ? "},{"$f":"'5 exo différents'!G41","v":"→"},{"$f":"'5 exo différents'!H41","v":"…………………"},3,4,null,null,7,8]
[{"$f":"'5 exo différents'!A42","v":"c) "},{"$f":"'5 exo différents'!B42","v":"72 est la moitié de ?  "},{"$f":"'5 exo différents'!C42","v":"→"},{"$f":"'5 exo différents'!D42","v":"…………………"},{"$f":"'5 exo différents'!E42","v":"h) "},{"$f":"'5 exo différents'!F42","v":"84 est la moitié de ?  "},{"$f":"'5 exo différents'!G42","v":"→"},{"$f":"'5 exo différents'!H42","v":"…………………"},5,6,null,null,6,7]
[{"$f":"'5 exo différents'!A43","v":"d) "},{"$f":"'5 exo différents'!B43","v":"96 est le quadruple de ?  "},{"$f":"'5 exo différents'!C43","v":"→"},{"$f":"'5 exo différents'!D43","v":"…………………"},{"$f":"'5 exo différents'!E43","v":"i) "},{"$f":"'5 exo différents'!F43","v":"72 est le double de ?  "},{"$f":"'5 exo différents'!G43","v":"→"},{"$f":"'5 exo différents'!H43","v":"…………………"},7,8,null,null,5,6]
[{"$f":"'5 exo différents'!A44","v":"e) "},{"$f":"'5 exo différents'!B44","v":"108 est le quadruple de ?  "},{"$f":"'5 exo différents'!C44","v":"→"},{"$f":"'5 exo différents'!D44","v":"…………………"},{"$f":"'5 exo différents'!E44","v":"j) "},{"$f":"'5 exo différents'!F44","v":"48 est le triple de ?  "},{"$f":"'5 exo différents'!G44","v":"→"},{"$f":"'5 exo différents'!H44","v":"…………………"},9,10,null,null,4,5]
[]
[]
["Complète :",null,null,null,null,null,null,null,"Bornes",null,null,null,"Bornes"]
[null,null,null,null,null,null,null,null,"inf","sup",null,null,"inf","sup"]
[{"$f":"'5 exo différents'!A40","v":"a) "},{"$f":"'5 exo différents'!B40","v":"Quel est le quart de 12 ? "},{"$f":"'5 exo différents'!C40","v":"→"},{"$f":"'5 exo différents'!D40","v":"…………………"},{"$f":"'5 exo différents'!E40","v":"f) "},{"$f":"'5 exo différents'!F40","v":"Quelle est la moitié de 120 ? "},{"$f":"'5 exo différents'!G40","v":"→"},{"$f":"'5 exo différents'!H40","v":"…………………"},1,2,null,null,9,10]
[{"$f":"'5 exo différents'!A41","v":"b) "},{"$f":"'5 exo différents'!B41","v":"Quel est le double de 48 ? "},{"$f":"'5 exo différents'!C41","v":"→"},{"$f":"'5 exo différents'!D41","v":"…………………"},{"$f":"'5 exo différents'!E41","v":"g) "},{"$f":"'5 exo différents'!F41","v":"Quel est le quadruple de 84 ? "},{"$f":"'5 exo différents'!G41","v":"→"},{"$f":"'5 exo différents'!H41","v":"…………………"},3,4,null,null,7,8]
[{"$f":"'5 exo différents'!A42","v":"c) "},{"$f":"'5 exo différents'!B42","v":"72 est la moitié de ?  "},{"$f":"'5 exo différents'!C42","v":"→"},{"$f":"'5 exo différents'!D42","v":"…………………"},{"$f":"'5 exo différents'!E42","v":"h) "},{"$f":"'5 exo différents'!F42","v":"84 est la moitié de ?  "},{"$f":"'5 exo différents'!G42","v":"→"},{"$f":"'5 exo différents'!H42","v":"…………………"},5,6,null,null,6,7]
[{"$f":"'5 exo différents'!A43","v":"d) "},{"$f":"'5 exo différents'!B43","v":"96 est le quadruple de ?  "},{"$f":"'5 exo différents'!C43","v":"→"},{"$f":"'5 exo différents'!D43","v":"…………………"},{"$f":"'5 exo différents'!E43","v":"i) "},{"$f":"'5 exo différents'!F43","v":"72 est le double de ?  "},{"$f":"'5 exo différents'!G43","v":"→"},{"$f":"'5 exo différents'!H43","v":"…………………"},7,8,null,null,5,6]
[{"$f":"'5 exo différents'!A44","v":"e) "},{"$f":"'5 exo différents'!B44","v":"108 est le quadruple de ?  "},{"$f":"'5 exo différents'!C44","v":"→"},{"$f":"'5 exo différents'!D44","v":"…………………"},{"$f":"'5 exo différents'!E44","v":"j) "},{"$f":"'5 exo différents'!F44","v":"48 est le triple de ?  "},{"$f":"'5 exo différents'!G44","v":"→"},{"$f":"'5 exo différents'!H44","v":"…………………"},9,10,null,null,4,5]

{"sheet":"5 exos différents type mélangé","index":5,"n_rows":88,"n_cols":14,"rows_kept":88,"cut":false,"hidden":false,"merged":[[54,0,54,3],[63,0,63,3],[72,0,72,3],[81,0,81,3],[10,0,10,3],[45,0,45,3],[37,0,37,3],[0,0,0,7],[0,8,0,17],[1,0,1,3],[1,8,1,9],[1,12,1,13],[10,8,10,9],[10,12,10,13],[44,0,44,7],[37,8,37,9],[37,12,37,13],[19,0,19,3],[19,8,19,9],[19,12,19,13],[28,0,28,3],[28,8,28,9],[28,12,28,13]]}
["SAVOIR UTILISER LES MOTS  MOITIE / DOUBLE - TIERS / TRIPLE - QUART / QUADRUPLE",null,null,null,null,null,null,null,"Ne modifier que les cellules en violet en faisant attention à ce que la borne inf soit inférieure à la borne sup."]
["A. Complète :",null,null,null,null,null,null,null,"Bornes",null,null,null,"Bornes"]
[null,null,null,null,null,null,null,null,"inf","sup",null,null,"inf","sup"]
["a) ",{"$f":"CHOOSE(INT(RAND()*3)+1,\"Quelle est la moitié de \",\"Quel est le tiers de \",\"Quel est le quart de \") & (RANDBETWEEN(I4,J4)*12) & \" ? \"","v":"Quel est le tiers de 108 ? "},"→","…………………","f) ",{"$f":"CHOOSE(INT(RAND()*3)+1,\"Quelle est la moitié de \",\"Quel est le tiers de \",\"Quel est le quart de \") & (RANDBETWEEN(M4,N4)*12) & \" ? \"","v":"Quel est le tiers de 12 ? "},{"$f":"C4","v":"→"},"…………………",9,10,null,null,1,2]
["b) ",{"$f":"CHOOSE(INT(RAND()*3)+1,\"Quel est le double de \",\"Quel est le triple de \",\"Quel est le quadruple de \") & (RANDBETWEEN(I5,J5)*12) & \" ? \"","v":"Quel est le double de 96 ? "},"→","…………………","g) ",{"$f":"CHOOSE(INT(RAND()*3)+1,\"Quel est le double de \",\"Quel est le triple de \",\"Quel est le quadruple de \") & (RANDBETWEEN(M5,N5)*12) & \" ? \"","v":"Quel est le double de 36 ? "},{"$f":"C5","v":"→"},"…………………",7,8,null,null,3,4]
["c) ",{"$f":" (RANDBETWEEN(I6,J6)*12) & CHOOSE(INT(RAND()*3)+1,\" est la moitié de ?  \",\" est le tiers de ?  \",\" est le quart de ?  \")","v":"84 est le quart de ?  "},"→","…………………","h) ",{"$f":" (RANDBETWEEN(M6,N6)*12) & CHOOSE(INT(RAND()*3)+1,\" est la moitié de ?  \",\" est le tiers de ?  \",\" est le quart de ?  \")","v":"72 est la moitié de ?  "},"→","…………………",6,7,null,null,5,6]
["d) ",{"$f":" (RANDBETWEEN(I7,J7)*12) & CHOOSE(INT(RAND()*3)+1,\" est le double de ?  \",\" est le triple de ?  \",\" est le quadruple de ?  \")","v":"72 est le triple de ?  "},"→","…………………","i) ",{"$f":" (RANDBETWEEN(M7,N7)*12) & CHOOSE(INT(RAND()*3)+1,\" est le double de ?  \",\" est le triple de ?  \",\" est le quadruple de ?  \")","v":"84 est le double de ?  "},"→","…………………",5,6,null,null,7,8]
["e) ",{"$f":" (RANDBETWEEN(I8,J8)*12) & CHOOSE(INT(RAND()*3)+1,\" est le double de ?  \",\" est le triple de ?  \",\" est le quadruple de ?  \")","v":"48 est le quadruple de ?  "},"→","…………………","j) ",{"$f":" (RANDBETWEEN(M8,N8)*12) & CHOOSE(INT(RAND()*3)+1,\" est le double de ?  \",\" est le triple de ?  \",\" est le quadruple de ?  \")","v":"120 est le double de ?  "},"→","…………………",4,5,null,null,9,10]
[]
[]
["B. Complète :",null,null,null,null,null,null,null,"Bornes",null,null,null,"Bornes"]
[null,null,null,null,null,null,null,null,"inf","sup",null,null,"inf","sup"]
[{"$f":"A4","v":"a) "},{"$f":"CHOOSE(INT(RAND()*3)+1,\"Quelle est la moitié de \",\"Quel est le tiers de \",\"Quel est le quart de \") & (RANDBETWEEN(I13,J13)*12) & \" ? \"","v":"Quelle est la moitié de 12 ? "},"→","…………………",{"$f":"E4","v":"f) "},{"$f":"CHOOSE(INT(RAND()*3)+1,\"Quelle est la moitié de \",\"Quel est le tiers de \",\"Quel est le quart de \") & (RANDBETWEEN(M13,N13)*12) & \" ? \"","v":"Quel est le tiers de 108 ? "},{"$f":"C13","v":"→"},"…………………",1,2,null,null,9,10]
["b) ",{"$f":"CHOOSE(INT(RAND()*3)+1,\"Quel est le double de \",\"Quel est le triple de \",\"Quel est le quadruple de \") & (RANDBETWEEN(I14,J14)*12) & \" ? \"","v":"Quel est le quadruple de 48 ? "},"→","…………………","g) ",{"$f":"CHOOSE(INT(RAND()*3)+1,\"Quel est le double de \",\"Quel est le triple de \",\"Quel est le quadruple de \") & (RANDBETWEEN(M14,N14)*12) & \" ? \"","v":"Quel est le triple de 84 ? "},{"$f":"C14","v":"→"},"…………………",3,4,null,null,7,8]
["c) ",{"$f":" (RANDBETWEEN(I15,J15)*12) & CHOOSE(INT(RAND()*3)+1,\" est la moitié de ?  \",\" est le tiers de ?  \",\" est le quart de ?  \")","v":"60 est le quart de ?  "},"→","…………………","h) ",{"$f":" (RANDBETWEEN(M15,N15)*12) & CHOOSE(INT(RAND()*3)+1,\" est la moitié de ?  \",\" est le tiers de ?  \",\" est le quart de ?  \")","v":"84 est le quart de ?  "},"→","…………………",5,6,null,null,6,7]
["d) ",{"$f":" (RANDBETWEEN(I16,J16)*12) & CHOOSE(INT(RAND()*3)+1,\" est le double de ?  \",\" est le triple de ?  \",\" est le quadruple de ?  \")","v":"96 est le triple de ?  "},"→","…………………","i) ",{"$f":" (RANDBETWEEN(M16,N16)*12) & CHOOSE(INT(RAND()*3)+1,\" est le double de ?  \",\" est le triple de ?  \",\" est le quadruple de ?  \")","v":"60 est le triple de ?  "},"→","…………………",7,8,null,null,5,6]
["e) ",{"$f":" (RANDBETWEEN(I17,J17)*12) & CHOOSE(INT(RAND()*3)+1,\" est le double de ?  \",\" est le triple de ?  \",\" est le quadruple de ?  \")","v":"108 est le quadruple de ?  "},"→","…………………","j) ",{"$f":" (RANDBETWEEN(M17,N17)*12) & CHOOSE(INT(RAND()*3)+1,\" est le double de ?  \",\" est le triple de ?  \",\" est le quadruple de ?  \")","v":"60 est le double de ?  "},"→","…………………",9,10,null,null,4,5]
[]
[]
["C. Complète :",null,null,null,null,null,null,null,"Bornes",null,null,null,"Bornes"]
[null,null,null,null,null,null,null,null,"inf","sup",null,null,"inf","sup"]
[{"$f":"A4","v":"a) "},{"$f":"CHOOSE(INT(RAND()*3)+1,\"Quelle est la moitié de \",\"Quel est le tiers de \",\"Quel est le quart de \") & (RANDBETWEEN(I22,J22)*12) & \" ? \"","v":"Quel est le tiers de 120 ? "},"→","…………………",{"$f":"E4","v":"f) "},{"$f":"CHOOSE(INT(RAND()*3)+1,\"Quelle est la moitié de \",\"Quel est le tiers de \",\"Quel est le quart de \") & (RANDBETWEEN(M22,N22)*12) & \" ? \"","v":"Quelle est la moitié de 108 ? "},{"$f":"C22","v":"→"},"…………………",9,10,null,null,4,10]
["b) ",{"$f":"CHOOSE(INT(RAND()*3)+1,\"Quel est le double de \",\"Quel est le triple de \",\"Quel est le quadruple de \") & (RANDBETWEEN(I23,J23)*12) & \" ? \"","v":"Quel est le quadruple de 24 ? "},"→","…………………","g) ",{"$f":"CHOOSE(INT(RAND()*3)+1,\"Quel est le double de \",\"Quel est le triple de \",\"Quel est le quadruple de \") & (RANDBETWEEN(M23,N23)*12) & \" ? \"","v":"Quel est le double de 96 ? "},{"$f":"C23","v":"→"},"…………………",2,5,null,null,8,9]
["c) ",{"$f":" (RANDBETWEEN(I24,J24)*12) & CHOOSE(INT(RAND()*3)+1,\" est la moitié de ?  \",\" est le tiers de ?  \",\" est le quart de ?  \")","v":"72 est le quart de ?  "},"→","…………………","h) ",{"$f":" (RANDBETWEEN(M24,N24)*12) & CHOOSE(INT(RAND()*3)+1,\" est la moitié de ?  \",\" est le tiers de ?  \",\" est le quart de ?  \")","v":"84 est le quart de ?  "},"→","…………………",4,7,null,null,7,7]
["d) ",{"$f":" (RANDBETWEEN(I25,J25)*12) & CHOOSE(INT(RAND()*3)+1,\" est le double de ?  \",\" est le triple de ?  \",\" est le quadruple de ?  \")","v":"48 est le quadruple de ?  "},"→","…………………","i) ",{"$f":" (RANDBETWEEN(M25,N25)*12) & CHOOSE(INT(RAND()*3)+1,\" est le double de ?  \",\" est le triple de ?  \",\" est le quadruple de ?  \")","v":"72 est le triple de ?  "},"→","…………………",3,6,null,null,6,6]
["e) ",{"$f":" (RANDBETWEEN(I26,J26)*12) & CHOOSE(INT(RAND()*3)+1,\" est le double de ?  \",\" est le triple de ?  \",\" est le quadruple de ?  \")","v":"36 est le double de ?  "},"→","…………………","j) ",{"$f":" (RANDBETWEEN(M26,N26)*12) & CHOOSE(INT(RAND()*3)+1,\" est le double de ?  \",\" est le triple de ?  \",\" est le quadruple de ?  \")","v":"60 est le quadruple de ?  "},"→","…………………",1,8,null,null,5,5]
[]
[]
["D. Complète :",null,null,null,null,null,null,null,"Bornes",null,null,null,"Bornes"]
[null,null,null,null,null,null,null,null,"inf","sup",null,null,"inf","sup"]
[{"$f":"A4","v":"a) "},{"$f":"CHOOSE(INT(RAND()*3)+1,\"Quelle est la moitié de \",\"Quel est le tiers de \",\"Quel est le quart de \") & (RANDBETWEEN(I31,J31)*12) & \" ? \"","v":"Quel est le tiers de 12 ? "},"→","…………………",{"$f":"E4","v":"f) "},{"$f":"CHOOSE(INT(RAND()*3)+1,\"Quelle est la moitié de \",\"Quel est le tiers de \",\"Quel est le quart de \") & (RANDBETWEEN(M31,N31)*12) & \" ? \"","v":"Quelle est la moitié de 72 ? "},{"$f":"C31","v":"→"},"…………………",1,1,null,null,6,6]
["b) ",{"$f":"CHOOSE(INT(RAND()*3)+1,\"Quel est le double de \",\"Quel est le triple de \",\"Quel est le quadruple de \") & (RANDBETWEEN(I32,J32)*12) & \" ? \"","v":"Quel est le quadruple de 24 ? "},"→","…………………","g) ",{"$f":"CHOOSE(INT(RAND()*3)+1,\"Quel est le double de \",\"Quel est le triple de \",\"Quel est le quadruple de \") & (RANDBETWEEN(M32,N32)*12) & \" ? \"","v":"Quel est le triple de 84 ? "},{"$f":"C32","v":"→"},"…………………",2,2,null,null,7,7]
["c) ",{"$f":" (RANDBETWEEN(I33,J33)*12) & CHOOSE(INT(RAND()*3)+1,\" est la moitié de ?  \",\" est le tiers de ?  \",\" est le quart de ?  \")","v":"36 est le tiers de ?  "},"→","…………………","h) ",{"$f":" (RANDBETWEEN(M33,N33)*12) & CHOOSE(INT(RAND()*3)+1,\" est la moitié de ?  \",\" est le tiers de ?  \",\" est le quart de ?  \")","v":"96 est la moitié de ?  "},"→","…………………",3,3,null,null,8,8]
["d) ",{"$f":" (RANDBETWEEN(I34,J34)*12) & CHOOSE(INT(RAND()*3)+1,\" est le double de ?  \",\" est le triple de ?  \",\" est le quadruple de ?  \")","v":"48 est le triple de ?  "},"→","…………………","i) ",{"$f":" (RANDBETWEEN(M34,N34)*12) & CHOOSE(INT(RAND()*3)+1,\" est le double de ?  \",\" est le triple de ?  \",\" est le quadruple de ?  \")","v":"108 est le quadruple de ?  "},"→","…………………",4,4,null,null,9,9]
["e) ",{"$f":" (RANDBETWEEN(I35,J35)*12) & CHOOSE(INT(RAND()*3)+1,\" est le double de ?  \",\" est le triple de ?  \",\" est le quadruple de ?  \")","v":"60 est le quadruple de ?  "},"→","…………………","j) ",{"$f":" (RANDBETWEEN(M35,N35)*12) & CHOOSE(INT(RAND()*3)+1,\" est le double de ?  \",\" est le triple de ?  \",\" est le quadruple de ?  \")","v":"120 est le triple de ?  "},"→","…………………",5,5,null,null,10,10]
[]
[]
["E. Complète :",null,null,null,null,null,null,null,"Bornes",null,null,null,"Bornes"]
[null,null,null,null,null,null,null,null,"inf","sup",null,null,"inf","sup"]
[{"$f":"A4","v":"a) "},{"$f":"CHOOSE(INT(RAND()*3)+1,\"Quelle est la moitié de \",\"Quel est le tiers de \",\"Quel est le quart de \") & (RANDBETWEEN(I40,J40)*12) & \" ? \"","v":"Quel est le quart de 24 ? "},"→","…………………",{"$f":"E4","v":"f) "},{"$f":"CHOOSE(INT(RAND()*3)+1,\"Quelle est la moitié de \",\"Quel est le tiers de \",\"Quel est le quart de \") & (RANDBETWEEN(M40,N40)*12) & \" ? \"","v":"Quel est le quart de 84 ? "},{"$f":"C40","v":"→"},"…………………",2,2,null,null,7,7]
["b) ",{"$f":"CHOOSE(INT(RAND()*3)+1,\"Quel est le double de \",\"Quel est le triple de \",\"Quel est le quadruple de \") & (RANDBETWEEN(I41,J41)*12) & \" ? \"","v":"Quel est le quadruple de 36 ? "},"→","…………………","g) ",{"$f":"CHOOSE(INT(RAND()*3)+1,\"Quel est le double de \",\"Quel est le triple de \",\"Quel est le quadruple de \") & (RANDBETWEEN(M41,N41)*12) & \" ? \"","v":"Quel est le triple de 96 ? "},{"$f":"C41","v":"→"},"…………………",3,3,null,null,8,8]
["c) ",{"$f":" (RANDBETWEEN(I42,J42)*12) & CHOOSE(INT(RAND()*3)+1,\" est la moitié de ?  \",\" est le tiers de ?  \",\" est le quart de ?  \")","v":"48 est le tiers de ?  "},"→","…………………","h) ",{"$f":" (RANDBETWEEN(M42,N42)*12) & CHOOSE(INT(RAND()*3)+1,\" est la moitié de ?  \",\" est le tiers de ?  \",\" est le quart de ?  \")","v":"108 est le tiers de ?  "},"→","…………………",4,4,null,null,9,9]
["d) ",{"$f":" (RANDBETWEEN(I43,J43)*12) & CHOOSE(INT(RAND()*3)+1,\" est le double de ?  \",\" est le triple de ?  \",\" est le quadruple de ?  \")","v":"60 est le triple de ?  "},"→","…………………","i) ",{"$f":" (RANDBETWEEN(M43,N43)*12) & CHOOSE(INT(RAND()*3)+1,\" est le double de ?  \",\" est le triple de ?  \",\" est le quadruple de ?  \")","v":"120 est le double de ?  "},"→","…………………",5,5,null,null,10,10]
["e) ",{"$f":" (RANDBETWEEN(I44,J44)*12) & CHOOSE(INT(RAND()*3)+1,\" est le double de ?  \",\" est le triple de ?  \",\" est le quadruple de ?  \")","v":"12 est le double de ?  "},"→","…………………","j) ",{"$f":" (RANDBETWEEN(M44,N44)*12) & CHOOSE(INT(RAND()*3)+1,\" est le double de ?  \",\" est le triple de ?  \",\" est le quadruple de ?  \")","v":"72 est le double de ?  "},"→","…………………",1,1,null,null,6,6]
[{"$f":"A1","v":"SAVOIR UTILISER LES MOTS  MOITIE / DOUBLE - TIERS / TRIPLE - QUART / QUADRUPLE"},0,0,0,0,0,0,0]
[{"$f":"$A$2","v":"A. Complète :"}]
[]
["a) ","Quel est le tiers de 108 ? ","→","…………………","f) ","Quel est le tiers de 12 ? ","→","…………………"]
["b) ","Quel est le double de 96 ? ","→","…………………","g) ","Quel est le double de 36 ? ","→","…………………"]
["c) ","84 est le quart de ?  ","→","…………………","h) ","72 est la moitié de ?  ","→","…………………"]
["d) ","72 est le triple de ?  ","→","…………………","i) ","84 est le double de ?  ","→","…………………"]
["e) ","48 est le quadruple de ?  ","→","…………………","j) ","120 est le double de ?  ","→","…………………"]
[]
[]
[{"$f":"A11","v":"B. Complète :"},0,0,0]
[]
["a) ","Quelle est la moitié de 12 ? ","→","…………………","f) ","Quel est le tiers de 108 ? ","→","…………………"]
["b) ","Quel est le quadruple de 48 ? ","→","…………………","g) ","Quel est le triple de 84 ? ","→","…………………"]
["c) ","60 est le quart de ?  ","→","…………………","h) ","84 est le quart de ?  ","→","…………………"]
["d) ","96 est le triple de ?  ","→","…………………","i) ","60 est le triple de ?  ","→","…………………"]
["e) ","108 est le quadruple de ?  ","→","…………………","j) ","60 est le double de ?  ","→","…………………"]
[]
[]
["C. Complète :",0,0,0]
[]
[{"$f":"A22","v":"a) "},"Quel est le tiers de 120 ? ","→","…………………","f) ","Quelle est la moitié de 108 ? ","→","…………………"]
["b) ","Quel est le quadruple de 24 ? ","→","…………………","g) ","Quel est le double de 96 ? ","→","…………………"]
["c) ","72 est le quart de ?  ","→","…………………","h) ","84 est le quart de ?  ","→","…………………"]
["d) ","48 est le quadruple de ?  ","→","…………………","i) ","72 est le triple de ?  ","→","…………………"]
["e) ","36 est le double de ?  ","→","…………………","j) ","60 est le quadruple de ?  ","→","…………………"]
[]
[]
["D. Complète :",0,0,0]
[]
[{"$f":"A31","v":"a) "},"Quel est le tiers de 12 ? ","→","…………………","f) ","Quelle est la moitié de 72 ? ","→","…………………"]
["b) ","Quel est le quadruple de 24 ? ","→","…………………","g) ","Quel est le triple de 84 ? ","→","…………………"]
["c) ","36 est le tiers de ?  ","→","…………………","h) ","96 est la moitié de ?  ","→","…………………"]
["d) ","48 est le triple de ?  ","→","…………………","i) ","108 est le quadruple de ?  ","→","…………………"]
["e) ","60 est le quadruple de ?  ","→","…………………","j) ","120 est le triple de ?  ","→","…………………"]
[]
[]
["E. Complète :",0,0,0]
[]
["a) ","Quel est le quart de 24 ? ","→","…………………","f) ","Quel est le quart de 84 ? ","→","…………………"]
[{"$f":"A41","v":"b) "},"Quel est le quadruple de 36 ? ","→","…………………","g) ","Quel est le triple de 96 ? ","→","…………………"]
["c) ","48 est le tiers de ?  ","→","…………………","h) ","108 est le tiers de ?  ","→","…………………"]
["d) ","60 est le triple de ?  ","→","…………………","i) ","120 est le double de ?  ","→","…………………"]
["e) ","12 est le double de ?  ","→","…………………","j) ","72 est le double de ?  ","→","…………………"]

{"sheet":"5 exos différents type méla (2)","index":6,"n_rows":88,"n_cols":14,"rows_kept":88,"cut":false,"hidden":false,"merged":[[63,0,63,3],[72,0,72,3],[81,0,81,3],[37,0,37,3],[37,8,37,9],[37,12,37,13],[44,0,44,7],[45,0,45,3],[54,0,54,3],[19,0,19,3],[19,8,19,9],[19,12,19,13],[28,0,28,3],[28,8,28,9],[28,12,28,13],[10,0,10,3],[10,8,10,9],[10,12,10,13],[0,0,0,7],[0,8,0,17],[1,0,1,3],[1,8,1,9],[1,12,1,13]]}
["SAVOIR UTILISER LES MOTS  MOITIE / DOUBLE - TIERS / TRIPLE - QUART / QUADRUPLE",null,null,null,null,null,null,null,"Ne modifier que les cellules en violet en faisant attention à ce que la borne inf soit inférieure à la borne sup."]
["A. Complète :",null,null,null,null,null,null,null,"Bornes",null,null,null,"Bornes"]
[null,null,null,null,null,null,null,null,"inf","sup",null,null,"inf","sup"]
["a) ",{"$f":"CHOOSE(INT(RAND()*3)+1,\"Quelle est la moitié de \",\"Quel est le tiers de \",\"Quel est le quart de \") & (RANDBETWEEN(I4,J4)*12) & \" ? \"","v":"Quelle est la moitié de 120 ? "},"→",{"$f":"(1*(MID(B4,MATCH(0,(ISERROR(MID(B4,ROW(INDIRECT(\"1:\"&LEN(B4))),1)*1)*1),\n0),LEN(B4)-SUM((ISERROR(MID(B4,ROW(INDIRECT(\"1:\"&LEN(B4))),1)*1)*1)))\n/(IF(NOT(ISERROR(SEARCH(\"moitié\",B4))),\"2\",\nIF(NOT(ISERROR(SEARCH(\"tiers\",B4))),\"3\",\nIF(NOT(ISERROR(SEARCH(\"quart\",B4))),\"4\"))))))","v":60},"f) ",{"$f":"CHOOSE(INT(RAND()*3)+1,\"Quelle est la moitié de \",\"Quel est le tiers de \",\"Quel est le quart de \") & (RANDBETWEEN(M4,N4)*12) & \" ? \"","v":"Quelle est la moitié de 12 ? "},{"$f":"C4","v":"→"},{"$f":"(1*(MID(F4,MATCH(0,(ISERROR(MID(F4,ROW(INDIRECT(\"1:\"&LEN(F4))),1)*1)*1),\n0),LEN(F4)-SUM((ISERROR(MID(F4,ROW(INDIRECT(\"1:\"&LEN(F4))),1)*1)*1)))\n/(IF(NOT(ISERROR(SEARCH(\"moitié\",F4))),\"2\",\nIF(NOT(ISERROR(SEARCH(\"tiers\",F4))),\"3\",\nIF(NOT(ISERROR(SEARCH(\"quart\",F4))),\"4\"))))))","v":6},9,10,null,null,1,2]
["b) ",{"$f":"CHOOSE(INT(RAND()*3)+1,\"Quel est le double de \",\"Quel est le triple de \",\"Quel est le quadruple de \") & (RANDBETWEEN(I5,J5)*12) & \" ? \"","v":"Quel est le double de 96 ? "},"→",{"$f":"(IF(NOT(ISERROR(SEARCH(\"double\",B5))),\"2\",\nIF(NOT(ISERROR(SEARCH(\"triple\",B5))),\"3\",\nIF(NOT(ISERROR(SEARCH(\"quadruple\",B5))),\"4\"))))*\n1*(MID(B5,MATCH(0,(ISERROR(MID(B5,ROW(INDIRECT(\"1:\"&LEN(B5))),1)*1)*1),\n0),LEN(B5)-SUM((ISERROR(MID(B5,ROW(INDIRECT(\"1:\"&LEN(B5))),1)*1)*1)))\n)","v":192},"g) ",{"$f":"CHOOSE(INT(RAND()*3)+1,\"Quel est le double de \",\"Quel est le triple de \",\"Quel est le quadruple de \") & (RANDBETWEEN(M5,N5)*12) & \" ? \"","v":"Quel est le triple de 48 ? "},{"$f":"C5","v":"→"},{"$f":"(IF(NOT(ISERROR(SEARCH(\"double\",F5))),\"2\",\nIF(NOT(ISERROR(SEARCH(\"triple\",F5))),\"3\",\nIF(NOT(ISERROR(SEARCH(\"quadruple\",F5))),\"4\"))))*\n1*(MID(F5,MATCH(0,(ISERROR(MID(F5,ROW(INDIRECT(\"1:\"&LEN(F5))),1)*1)*1),\n0),LEN(F5)-SUM((ISERROR(MID(F5,ROW(INDIRECT(\"1:\"&LEN(F5))),1)*1)*1)))\n)","v":144},7,8,null,null,3,4]
["c) ",{"$f":" (RANDBETWEEN(I6,J6)*12) & CHOOSE(INT(RAND()*3)+1,\" est la moitié de ?  \",\" est le tiers de ?  \",\" est le quart de ?  \")","v":"72 est le tiers de ?  "},"→",{"$f":"(1*(MID(B6,MATCH(0,(ISERROR(MID(B6,ROW(INDIRECT(\"1:\"&LEN(B6))),1)*1)*1),\n0),LEN(B6)-SUM((ISERROR(MID(B6,ROW(INDIRECT(\"1:\"&LEN(B6))),1)*1)*1)))\n*(IF(NOT(ISERROR(SEARCH(\"moitié\",B6))),\"2\",\nIF(NOT(ISERROR(SEARCH(\"tiers\",B6))),\"3\",\nIF(NOT(ISERROR(SEARCH(\"quart\",B6))),\"4\"))))))","v":216},"h) ",{"$f":" (RANDBETWEEN(M6,N6)*12) & CHOOSE(INT(RAND()*3)+1,\" est la moitié de ?  \",\" est le tiers de ?  \",\" est le quart de ?  \")","v":"60 est le tiers de ?  "},"→",{"$f":"(1*(MID(F6,MATCH(0,(ISERROR(MID(F6,ROW(INDIRECT(\"1:\"&LEN(F6))),1)*1)*1),\n0),LEN(F6)-SUM((ISERROR(MID(F6,ROW(INDIRECT(\"1:\"&LEN(F6))),1)*1)*1)))\n*(IF(NOT(ISERROR(SEARCH(\"moitié\",F6))),\"2\",\nIF(NOT(ISERROR(SEARCH(\"tiers\",F6))),\"3\",\nIF(NOT(ISERROR(SEARCH(\"quart\",F6))),\"4\"))))))","v":180},6,7,null,null,5,6]
["d) ",{"$f":" (RANDBETWEEN(I7,J7)*12) & CHOOSE(INT(RAND()*3)+1,\" est le double de ?  \",\" est le triple de ?  \",\" est le quadruple de ?  \")","v":"72 est le double de ?  "},"→",{"$f":"1*(MID(B7,MATCH(0,(ISERROR(MID(B7,ROW(INDIRECT(\"1:\"&LEN(B7))),1)*1)*1),\n0),LEN(B7)-SUM((ISERROR(MID(B7,ROW(INDIRECT(\"1:\"&LEN(B7))),1)*1)*1)))\n)/(IF(NOT(ISERROR(SEARCH(\"double\",B7))),\"2\",\nIF(NOT(ISERROR(SEARCH(\"triple\",B7))),\"3\",\nIF(NOT(ISERROR(SEARCH(\"quadruple\",B7))),\"4\"))))","v":36},"i) ",{"$f":" (RANDBETWEEN(M7,N7)*12) & CHOOSE(INT(RAND()*3)+1,\" est le double de ?  \",\" est le triple de ?  \",\" est le quadruple de ?  \")","v":"96 est le double de ?  "},"→",{"$f":"1*(MID(F7,MATCH(0,(ISERROR(MID(F7,ROW(INDIRECT(\"1:\"&LEN(F7))),1)*1)*1),\n0),LEN(F7)-SUM((ISERROR(MID(F7,ROW(INDIRECT(\"1:\"&LEN(F7))),1)*1)*1)))\n)/(IF(NOT(ISERROR(SEARCH(\"double\",F7))),\"2\",\nIF(NOT(ISERROR(SEARCH(\"triple\",F7))),\"3\",\nIF(NOT(ISERROR(SEARCH(\"quadruple\",F7))),\"4\"))))","v":48},5,6,null,null,7,8]
["e) ",{"$f":" (RANDBETWEEN(I8,J8)*12) & CHOOSE(INT(RAND()*3)+1,\" est le double de ?  \",\" est le triple de ?  \",\" est le quadruple de ?  \")","v":"48 est le double de ?  "},"→",{"$f":"1*(MID(B8,MATCH(0,(ISERROR(MID(B8,ROW(INDIRECT(\"1:\"&LEN(B8))),1)*1)*1),\n0),LEN(B8)-SUM((ISERROR(MID(B8,ROW(INDIRECT(\"1:\"&LEN(B8))),1)*1)*1)))\n)/(IF(NOT(ISERROR(SEARCH(\"double\",B8))),\"2\",\nIF(NOT(ISERROR(SEARCH(\"triple\",B8))),\"3\",\nIF(NOT(ISERROR(SEARCH(\"quadruple\",B8))),\"4\"))))","v":24},"j) ",{"$f":" (RANDBETWEEN(M8,N8)*12) & CHOOSE(INT(RAND()*3)+1,\" est le double de ?  \",\" est le triple de ?  \",\" est le quadruple de ?  \")","v":"108 est le double de ?  "},"→",{"$f":"1*(MID(F8,MATCH(0,(ISERROR(MID(F8,ROW(INDIRECT(\"1:\"&LEN(F8))),1)*1)*1),\n0),LEN(F8)-SUM((ISERROR(MID(F8,ROW(INDIRECT(\"1:\"&LEN(F8))),1)*1)*1)))\n)/(IF(NOT(ISERROR(SEARCH(\"double\",F8))),\"2\",\nIF(NOT(ISERROR(SEARCH(\"triple\",F8))),\"3\",\nIF(NOT(ISERROR(SEARCH(\"quadruple\",F8))),\"4\"))))","v":54},4,5,null,null,9,10]
[]
[]
["B. Complète :",null,null,null,null,null,null,null,"Bornes",null,null,null,"Bornes"]
[null,null,null,null,null,null,null,null,"inf","sup",null,null,"inf","sup"]
[{"$f":"A4","v":"a) "},{"$f":"CHOOSE(INT(RAND()*3)+1,\"Quelle est la moitié de \",\"Quel est le tiers de \",\"Quel est le quart de \") & (RANDBETWEEN(I13,J13)*12) & \" ? \"","v":"Quelle est la moitié de 24 ? "},"→",{"$f":"(1*(MID(B13,MATCH(0,(ISERROR(MID(B13,ROW(INDIRECT(\"1:\"&LEN(B13))),1)*1)*1),\n0),LEN(B13)-SUM((ISERROR(MID(B13,ROW(INDIRECT(\"1:\"&LEN(B13))),1)*1)*1)))\n/(IF(NOT(ISERROR(SEARCH(\"moitié\",B13))),\"2\",\nIF(NOT(ISERROR(SEARCH(\"tiers\",B13))),\"3\",\nIF(NOT(ISERROR(SEARCH(\"quart\",B13))),\"4\"))))))","v":12},{"$f":"E4","v":"f) "},{"$f":"CHOOSE(INT(RAND()*3)+1,\"Quelle est la moitié de \",\"Quel est le tiers de \",\"Quel est le quart de \") & (RANDBETWEEN(M13,N13)*12) & \" ? \"","v":"Quelle est la moitié de 120 ? "},{"$f":"C13","v":"→"},{"$f":"(1*(MID(F13,MATCH(0,(ISERROR(MID(F13,ROW(INDIRECT(\"1:\"&LEN(F13))),1)*1)*1),\n0),LEN(F13)-SUM((ISERROR(MID(F13,ROW(INDIRECT(\"1:\"&LEN(F13))),1)*1)*1)))\n/(IF(NOT(ISERROR(SEARCH(\"moitié\",F13))),\"2\",\nIF(NOT(ISERROR(SEARCH(\"tiers\",F13))),\"3\",\nIF(NOT(ISERROR(SEARCH(\"quart\",F13))),\"4\"))))))","v":60},1,2,null,null,9,10]
["b) ",{"$f":"CHOOSE(INT(RAND()*3)+1,\"Quel est le double de \",\"Quel est le triple de \",\"Quel est le quadruple de \") & (RANDBETWEEN(I14,J14)*12) & \" ? \"","v":"Quel est le triple de 48 ? "},"→",{"$f":"(IF(NOT(ISERROR(SEARCH(\"double\",B14))),\"2\",\nIF(NOT(ISERROR(SEARCH(\"triple\",B14))),\"3\",\nIF(NOT(ISERROR(SEARCH(\"quadruple\",B14))),\"4\"))))*\n1*(MID(B14,MATCH(0,(ISERROR(MID(B14,ROW(INDIRECT(\"1:\"&LEN(B14))),1)*1)*1),\n0),LEN(B14)-SUM((ISERROR(MID(B14,ROW(INDIRECT(\"1:\"&LEN(B14))),1)*1)*1)))\n)","v":144},"g) ",{"$f":"CHOOSE(INT(RAND()*3)+1,\"Quel est le double de \",\"Quel est le triple de \",\"Quel est le quadruple de \") & (RANDBETWEEN(M14,N14)*12) & \" ? \"","v":"Quel est le triple de 84 ? "},{"$f":"C14","v":"→"},{"$f":"(IF(NOT(ISERROR(SEARCH(\"double\",F14))),\"2\",\nIF(NOT(ISERROR(SEARCH(\"triple\",F14))),\"3\",\nIF(NOT(ISERROR(SEARCH(\"quadruple\",F14))),\"4\"))))*\n1*(MID(F14,MATCH(0,(ISERROR(MID(F14,ROW(INDIRECT(\"1:\"&LEN(F14))),1)*1)*1),\n0),LEN(F14)-SUM((ISERROR(MID(F14,ROW(INDIRECT(\"1:\"&LEN(F14))),1)*1)*1)))\n)","v":252},3,4,null,null,7,8]
["c) ",{"$f":" (RANDBETWEEN(I15,J15)*12) & CHOOSE(INT(RAND()*3)+1,\" est la moitié de ?  \",\" est le tiers de ?  \",\" est le quart de ?  \")","v":"60 est le tiers de ?  "},"→",{"$f":"(1*(MID(B15,MATCH(0,(ISERROR(MID(B15,ROW(INDIRECT(\"1:\"&LEN(B15))),1)*1)*1),\n0),LEN(B15)-SUM((ISERROR(MID(B15,ROW(INDIRECT(\"1:\"&LEN(B15))),1)*1)*1)))\n*(IF(NOT(ISERROR(SEARCH(\"moitié\",B15))),\"2\",\nIF(NOT(ISERROR(SEARCH(\"tiers\",B15))),\"3\",\nIF(NOT(ISERROR(SEARCH(\"quart\",B15))),\"4\"))))))","v":180},"h) ",{"$f":" (RANDBETWEEN(M15,N15)*12) & CHOOSE(INT(RAND()*3)+1,\" est la moitié de ?  \",\" est le tiers de ?  \",\" est le quart de ?  \")","v":"72 est la moitié de ?  "},"→",{"$f":"(1*(MID(F15,MATCH(0,(ISERROR(MID(F15,ROW(INDIRECT(\"1:\"&LEN(F15))),1)*1)*1),\n0),LEN(F15)-SUM((ISERROR(MID(F15,ROW(INDIRECT(\"1:\"&LEN(F15))),1)*1)*1)))\n*(IF(NOT(ISERROR(SEARCH(\"moitié\",F15))),\"2\",\nIF(NOT(ISERROR(SEARCH(\"tiers\",F15))),\"3\",\nIF(NOT(ISERROR(SEARCH(\"quart\",F15))),\"4\"))))))","v":144},5,6,null,null,6,7]
["d) ",{"$f":" (RANDBETWEEN(I16,J16)*12) & CHOOSE(INT(RAND()*3)+1,\" est le double de ?  \",\" est le triple de ?  \",\" est le quadruple de ?  \")","v":"96 est le double de ?  "},"→",{"$f":"1*(MID(B16,MATCH(0,(ISERROR(MID(B16,ROW(INDIRECT(\"1:\"&LEN(B16))),1)*1)*1),\n0),LEN(B16)-SUM((ISERROR(MID(B16,ROW(INDIRECT(\"1:\"&LEN(B16))),1)*1)*1)))\n)/(IF(NOT(ISERROR(SEARCH(\"double\",B16))),\"2\",\nIF(NOT(ISERROR(SEARCH(\"triple\",B16))),\"3\",\nIF(NOT(ISERROR(SEARCH(\"quadruple\",B16))),\"4\"))))","v":48},"i) ",{"$f":" (RANDBETWEEN(M16,N16)*12) & CHOOSE(INT(RAND()*3)+1,\" est le double de ?  \",\" est le triple de ?  \",\" est le quadruple de ?  \")","v":"60 est le quadruple de ?  "},"→",{"$f":"1*(MID(F16,MATCH(0,(ISERROR(MID(F16,ROW(INDIRECT(\"1:\"&LEN(F16))),1)*1)*1),\n0),LEN(F16)-SUM((ISERROR(MID(F16,ROW(INDIRECT(\"1:\"&LEN(F16))),1)*1)*1)))\n)/(IF(NOT(ISERROR(SEARCH(\"double\",F16))),\"2\",\nIF(NOT(ISERROR(SEARCH(\"triple\",F16))),\"3\",\nIF(NOT(ISERROR(SEARCH(\"quadruple\",F16))),\"4\"))))","v":15},7,8,null,null,5,6]
["e) ",{"$f":" (RANDBETWEEN(I17,J17)*12) & CHOOSE(INT(RAND()*3)+1,\" est le double de ?  \",\" est le triple de ?  \",\" est le quadruple de ?  \")","v":"108 est le triple de ?  "},"→",{"$f":"1*(MID(B17,MATCH(0,(ISERROR(MID(B17,ROW(INDIRECT(\"1:\"&LEN(B17))),1)*1)*1),\n0),LEN(B17)-SUM((ISERROR(MID(B17,ROW(INDIRECT(\"1:\"&LEN(B17))),1)*1)*1)))\n)/(IF(NOT(ISERROR(SEARCH(\"double\",B17))),\"2\",\nIF(NOT(ISERROR(SEARCH(\"triple\",B17))),\"3\",\nIF(NOT(ISERROR(SEARCH(\"quadruple\",B17))),\"4\"))))","v":36},"j) ",{"$f":" (RANDBETWEEN(M17,N17)*12) & CHOOSE(INT(RAND()*3)+1,\" est le double de ?  \",\" est le triple de ?  \",\" est le quadruple de ?  \")","v":"60 est le double de ?  "},"→",{"$f":"1*(MID(F17,MATCH(0,(ISERROR(MID(F17,ROW(INDIRECT(\"1:\"&LEN(F17))),1)*1)*1),\n0),LEN(F17)-SUM((ISERROR(MID(F17,ROW(INDIRECT(\"1:\"&LEN(F17))),1)*1)*1)))\n)/(IF(NOT(ISERROR(SEARCH(\"double\",F17))),\"2\",\nIF(NOT(ISERROR(SEARCH(\"triple\",F17))),\"3\",\nIF(NOT(ISERROR(SEARCH(\"quadruple\",F17))),\"4\"))))","v":30},9,10,null,null,4,5]
[]
[]
["C. Complète :",null,null,null,null,null,null,null,"Bornes",null,null,null,"Bornes"]
[null,null,null,null,null,null,null,null,"inf","sup",null,null,"inf","sup"]
[{"$f":"A4","v":"a) "},{"$f":"CHOOSE(INT(RAND()*3)+1,\"Quelle est la moitié de \",\"Quel est le tiers de \",\"Quel est le quart de \") & (RANDBETWEEN(I22,J22)*12) & \" ? \"","v":"Quel est le tiers de 108 ? "},"→",{"$f":"(1*(MID(B22,MATCH(0,(ISERROR(MID(B22,ROW(INDIRECT(\"1:\"&LEN(B22))),1)*1)*1),\n0),LEN(B22)-SUM((ISERROR(MID(B22,ROW(INDIRECT(\"1:\"&LEN(B22))),1)*1)*1)))\n/(IF(NOT(ISERROR(SEARCH(\"moitié\",B22))),\"2\",\nIF(NOT(ISERROR(SEARCH(\"tiers\",B22))),\"3\",\nIF(NOT(ISERROR(SEARCH(\"quart\",B22))),\"4\"))))))","v":36},{"$f":"E4","v":"f) "},{"$f":"CHOOSE(INT(RAND()*3)+1,\"Quelle est la moitié de \",\"Quel est le tiers de \",\"Quel est le quart de \") & (RANDBETWEEN(M22,N22)*12) & \" ? \"","v":"Quelle est la moitié de 72 ? "},{"$f":"C22","v":"→"},{"$f":"(1*(MID(F22,MATCH(0,(ISERROR(MID(F22,ROW(INDIRECT(\"1:\"&LEN(F22))),1)*1)*1),\n0),LEN(F22)-SUM((ISERROR(MID(F22,ROW(INDIRECT(\"1:\"&LEN(F22))),1)*1)*1)))\n/(IF(NOT(ISERROR(SEARCH(\"moitié\",F22))),\"2\",\nIF(NOT(ISERROR(SEARCH(\"tiers\",F22))),\"3\",\nIF(NOT(ISERROR(SEARCH(\"quart\",F22))),\"4\"))))))","v":36},9,10,null,null,4,10]
["b) ",{"$f":"CHOOSE(INT(RAND()*3)+1,\"Quel est le double de \",\"Quel est le triple de \",\"Quel est le quadruple de \") & (RANDBETWEEN(I23,J23)*12) & \" ? \"","v":"Quel est le double de 48 ? "},"→",{"$f":"(IF(NOT(ISERROR(SEARCH(\"double\",B23))),\"2\",\nIF(NOT(ISERROR(SEARCH(\"triple\",B23))),\"3\",\nIF(NOT(ISERROR(SEARCH(\"quadruple\",B23))),\"4\"))))*\n1*(MID(B23,MATCH(0,(ISERROR(MID(B23,ROW(INDIRECT(\"1:\"&LEN(B23))),1)*1)*1),\n0),LEN(B23)-SUM((ISERROR(MID(B23,ROW(INDIRECT(\"1:\"&LEN(B23))),1)*1)*1)))\n)","v":96},"g) ",{"$f":"CHOOSE(INT(RAND()*3)+1,\"Quel est le double de \",\"Quel est le triple de \",\"Quel est le quadruple de \") & (RANDBETWEEN(M23,N23)*12) & \" ? \"","v":"Quel est le double de 96 ? "},{"$f":"C23","v":"→"},{"$f":"(IF(NOT(ISERROR(SEARCH(\"double\",F23))),\"2\",\nIF(NOT(ISERROR(SEARCH(\"triple\",F23))),\"3\",\nIF(NOT(ISERROR(SEARCH(\"quadruple\",F23))),\"4\"))))*\n1*(MID(F23,MATCH(0,(ISERROR(MID(F23,ROW(INDIRECT(\"1:\"&LEN(F23))),1)*1)*1),\n0),LEN(F23)-SUM((ISERROR(MID(F23,ROW(INDIRECT(\"1:\"&LEN(F23))),1)*1)*1)))\n)","v":192},2,5,null,null,8,9]
["c) ",{"$f":" (RANDBETWEEN(I24,J24)*12) & CHOOSE(INT(RAND()*3)+1,\" est la moitié de ?  \",\" est le tiers de ?  \",\" est le quart de ?  \")","v":"72 est la moitié de ?  "},"→",{"$f":"(1*(MID(B24,MATCH(0,(ISERROR(MID(B24,ROW(INDIRECT(\"1:\"&LEN(B24))),1)*1)*1),\n0),LEN(B24)-SUM((ISERROR(MID(B24,ROW(INDIRECT(\"1:\"&LEN(B24))),1)*1)*1)))\n*(IF(NOT(ISERROR(SEARCH(\"moitié\",B24))),\"2\",\nIF(NOT(ISERROR(SEARCH(\"tiers\",B24))),\"3\",\nIF(NOT(ISERROR(SEARCH(\"quart\",B24))),\"4\"))))))","v":144},"h) ",{"$f":" (RANDBETWEEN(M24,N24)*12) & CHOOSE(INT(RAND()*3)+1,\" est la moitié de ?  \",\" est le tiers de ?  \",\" est le quart de ?  \")","v":"84 est le tiers de ?  "},"→",{"$f":"(1*(MID(F24,MATCH(0,(ISERROR(MID(F24,ROW(INDIRECT(\"1:\"&LEN(F24))),1)*1)*1),\n0),LEN(F24)-SUM((ISERROR(MID(F24,ROW(INDIRECT(\"1:\"&LEN(F24))),1)*1)*1)))\n*(IF(NOT(ISERROR(SEARCH(\"moitié\",F24))),\"2\",\nIF(NOT(ISERROR(SEARCH(\"tiers\",F24))),\"3\",\nIF(NOT(ISERROR(SEARCH(\"quart\",F24))),\"4\"))))))","v":252},4,7,null,null,7,7]
["d) ",{"$f":" (RANDBETWEEN(I25,J25)*12) & CHOOSE(INT(RAND()*3)+1,\" est le double de ?  \",\" est le triple de ?  \",\" est le quadruple de ?  \")","v":"36 est le triple de ?  "},"→",{"$f":"1*(MID(B25,MATCH(0,(ISERROR(MID(B25,ROW(INDIRECT(\"1:\"&LEN(B25))),1)*1)*1),\n0),LEN(B25)-SUM((ISERROR(MID(B25,ROW(INDIRECT(\"1:\"&LEN(B25))),1)*1)*1)))\n)/(IF(NOT(ISERROR(SEARCH(\"double\",B25))),\"2\",\nIF(NOT(ISERROR(SEARCH(\"triple\",B25))),\"3\",\nIF(NOT(ISERROR(SEARCH(\"quadruple\",B25))),\"4\"))))","v":12},"i) ",{"$f":" (RANDBETWEEN(M25,N25)*12) & CHOOSE(INT(RAND()*3)+1,\" est le double de ?  \",\" est le triple de ?  \",\" est le quadruple de ?  \")","v":"72 est le quadruple de ?  "},"→",{"$f":"1*(MID(F25,MATCH(0,(ISERROR(MID(F25,ROW(INDIRECT(\"1:\"&LEN(F25))),1)*1)*1),\n0),LEN(F25)-SUM((ISERROR(MID(F25,ROW(INDIRECT(\"1:\"&LEN(F25))),1)*1)*1)))\n)/(IF(NOT(ISERROR(SEARCH(\"double\",F25))),\"2\",\nIF(NOT(ISERROR(SEARCH(\"triple\",F25))),\"3\",\nIF(NOT(ISERROR(SEARCH(\"quadruple\",F25))),\"4\"))))","v":18},3,6,null,null,6,6]
["e) ",{"$f":" (RANDBETWEEN(I26,J26)*12) & CHOOSE(INT(RAND()*3)+1,\" est le double de ?  \",\" est le triple de ?  \",\" est le quadruple de ?  \")","v":"72 est le double de ?  "},"→",{"$f":"1*(MID(B26,MATCH(0,(ISERROR(MID(B26,ROW(INDIRECT(\"1:\"&LEN(B26))),1)*1)*1),\n0),LEN(B26)-SUM((ISERROR(MID(B26,ROW(INDIRECT(\"1:\"&LEN(B26))),1)*1)*1)))\n)/(IF(NOT(ISERROR(SEARCH(\"double\",B26))),\"2\",\nIF(NOT(ISERROR(SEARCH(\"triple\",B26))),\"3\",\nIF(NOT(ISERROR(SEARCH(\"quadruple\",B26))),\"4\"))))","v":36},"j) ",{"$f":" (RANDBETWEEN(M26,N26)*12) & CHOOSE(INT(RAND()*3)+1,\" est le double de ?  \",\" est le triple de ?  \",\" est le quadruple de ?  \")","v":"60 est le triple de ?  "},"→",{"$f":"1*(MID(F26,MATCH(0,(ISERROR(MID(F26,ROW(INDIRECT(\"1:\"&LEN(F26))),1)*1)*1),\n0),LEN(F26)-SUM((ISERROR(MID(F26,ROW(INDIRECT(\"1:\"&LEN(F26))),1)*1)*1)))\n)/(IF(NOT(ISERROR(SEARCH(\"double\",F26))),\"2\",\nIF(NOT(ISERROR(SEARCH(\"triple\",F26))),\"3\",\nIF(NOT(ISERROR(SEARCH(\"quadruple\",F26))),\"4\"))))","v":20},1,8,null,null,5,5]
[]
[]
["D. Complète :",null,null,null,null,null,null,null,"Bornes",null,null,null,"Bornes"]
[null,null,null,null,null,null,null,null,"inf","sup",null,null,"inf","sup"]
[{"$f":"A4","v":"a) "},{"$f":"CHOOSE(INT(RAND()*3)+1,\"Quelle est la moitié de \",\"Quel est le tiers de \",\"Quel est le quart de \") & (RANDBETWEEN(I31,J31)*12) & \" ? \"","v":"Quel est le quart de 12 ? "},"→",{"$f":"(1*(MID(B31,MATCH(0,(ISERROR(MID(B31,ROW(INDIRECT(\"1:\"&LEN(B31))),1)*1)*1),\n0),LEN(B31)-SUM((ISERROR(MID(B31,ROW(INDIRECT(\"1:\"&LEN(B31))),1)*1)*1)))\n/(IF(NOT(ISERROR(SEARCH(\"moitié\",B31))),\"2\",\nIF(NOT(ISERROR(SEARCH(\"tiers\",B31))),\"3\",\nIF(NOT(ISERROR(SEARCH(\"quart\",B31))),\"4\"))))))","v":3},{"$f":"E4","v":"f) "},{"$f":"CHOOSE(INT(RAND()*3)+1,\"Quelle est la moitié de \",\"Quel est le tiers de \",\"Quel est le quart de \") & (RANDBETWEEN(M31,N31)*12) & \" ? \"","v":"Quel est le quart de 72 ? "},{"$f":"C31","v":"→"},{"$f":"(1*(MID(F31,MATCH(0,(ISERROR(MID(F31,ROW(INDIRECT(\"1:\"&LEN(F31))),1)*1)*1),\n0),LEN(F31)-SUM((ISERROR(MID(F31,ROW(INDIRECT(\"1:\"&LEN(F31))),1)*1)*1)))\n/(IF(NOT(ISERROR(SEARCH(\"moitié\",F31))),\"2\",\nIF(NOT(ISERROR(SEARCH(\"tiers\",F31))),\"3\",\nIF(NOT(ISERROR(SEARCH(\"quart\",F31))),\"4\"))))))","v":18},1,1,null,null,6,6]
["b) ",{"$f":"CHOOSE(INT(RAND()*3)+1,\"Quel est le double de \",\"Quel est le triple de \",\"Quel est le quadruple de \") & (RANDBETWEEN(I32,J32)*12) & \" ? \"","v":"Quel est le quadruple de 24 ? "},"→",{"$f":"(IF(NOT(ISERROR(SEARCH(\"double\",B32))),\"2\",\nIF(NOT(ISERROR(SEARCH(\"triple\",B32))),\"3\",\nIF(NOT(ISERROR(SEARCH(\"quadruple\",B32))),\"4\"))))*\n1*(MID(B32,MATCH(0,(ISERROR(MID(B32,ROW(INDIRECT(\"1:\"&LEN(B32))),1)*1)*1),\n0),LEN(B32)-SUM((ISERROR(MID(B32,ROW(INDIRECT(\"1:\"&LEN(B32))),1)*1)*1)))\n)","v":96},"g) ",{"$f":"CHOOSE(INT(RAND()*3)+1,\"Quel est le double de \",\"Quel est le triple de \",\"Quel est le quadruple de \") & (RANDBETWEEN(M32,N32)*12) & \" ? \"","v":"Quel est le quadruple de 84 ? "},{"$f":"C32","v":"→"},{"$f":"(IF(NOT(ISERROR(SEARCH(\"double\",F32))),\"2\",\nIF(NOT(ISERROR(SEARCH(\"triple\",F32))),\"3\",\nIF(NOT(ISERROR(SEARCH(\"quadruple\",F32))),\"4\"))))*\n1*(MID(F32,MATCH(0,(ISERROR(MID(F32,ROW(INDIRECT(\"1:\"&LEN(F32))),1)*1)*1),\n0),LEN(F32)-SUM((ISERROR(MID(F32,ROW(INDIRECT(\"1:\"&LEN(F32))),1)*1)*1)))\n)","v":336},2,2,null,null,7,7]
["c) ",{"$f":" (RANDBETWEEN(I33,J33)*12) & CHOOSE(INT(RAND()*3)+1,\" est la moitié de ?  \",\" est le tiers de ?  \",\" est le quart de ?  \")","v":"36 est le quart de ?  "},"→",{"$f":"(1*(MID(B33,MATCH(0,(ISERROR(MID(B33,ROW(INDIRECT(\"1:\"&LEN(B33))),1)*1)*1),\n0),LEN(B33)-SUM((ISERROR(MID(B33,ROW(INDIRECT(\"1:\"&LEN(B33))),1)*1)*1)))\n*(IF(NOT(ISERROR(SEARCH(\"moitié\",B33))),\"2\",\nIF(NOT(ISERROR(SEARCH(\"tiers\",B33))),\"3\",\nIF(NOT(ISERROR(SEARCH(\"quart\",B33))),\"4\"))))))","v":144},"h) ",{"$f":" (RANDBETWEEN(M33,N33)*12) & CHOOSE(INT(RAND()*3)+1,\" est la moitié de ?  \",\" est le tiers de ?  \",\" est le quart de ?  \")","v":"96 est le quart de ?  "},"→",{"$f":"(1*(MID(F33,MATCH(0,(ISERROR(MID(F33,ROW(INDIRECT(\"1:\"&LEN(F33))),1)*1)*1),\n0),LEN(F33)-SUM((ISERROR(MID(F33,ROW(INDIRECT(\"1:\"&LEN(F33))),1)*1)*1)))\n*(IF(NOT(ISERROR(SEARCH(\"moitié\",F33))),\"2\",\nIF(NOT(ISERROR(SEARCH(\"tiers\",F33))),\"3\",\nIF(NOT(ISERROR(SEARCH(\"quart\",F33))),\"4\"))))))","v":384},3,3,null,null,8,8]
["d) ",{"$f":" (RANDBETWEEN(I34,J34)*12) & CHOOSE(INT(RAND()*3)+1,\" est le double de ?  \",\" est le triple de ?  \",\" est le quadruple de ?  \")","v":"48 est le triple de ?  "},"→",{"$f":"1*(MID(B34,MATCH(0,(ISERROR(MID(B34,ROW(INDIRECT(\"1:\"&LEN(B34))),1)*1)*1),\n0),LEN(B34)-SUM((ISERROR(MID(B34,ROW(INDIRECT(\"1:\"&LEN(B34))),1)*1)*1)))\n)/(IF(NOT(ISERROR(SEARCH(\"double\",B34))),\"2\",\nIF(NOT(ISERROR(SEARCH(\"triple\",B34))),\"3\",\nIF(NOT(ISERROR(SEARCH(\"quadruple\",B34))),\"4\"))))","v":16},"i) ",{"$f":" (RANDBETWEEN(M34,N34)*12) & CHOOSE(INT(RAND()*3)+1,\" est le double de ?  \",\" est le triple de ?  \",\" est le quadruple de ?  \")","v":"108 est le double de ?  "},"→",{"$f":"1*(MID(F34,MATCH(0,(ISERROR(MID(F34,ROW(INDIRECT(\"1:\"&LEN(F34))),1)*1)*1),\n0),LEN(F34)-SUM((ISERROR(MID(F34,ROW(INDIRECT(\"1:\"&LEN(F34))),1)*1)*1)))\n)/(IF(NOT(ISERROR(SEARCH(\"double\",F34))),\"2\",\nIF(NOT(ISERROR(SEARCH(\"triple\",F34))),\"3\",\nIF(NOT(ISERROR(SEARCH(\"quadruple\",F34))),\"4\"))))","v":54},4,4,null,null,9,9]
["e) ",{"$f":" (RANDBETWEEN(I35,J35)*12) & CHOOSE(INT(RAND()*3)+1,\" est le double de ?  \",\" est le triple de ?  \",\" est le quadruple de ?  \")","v":"60 est le double de ?  "},"→",{"$f":"1*(MID(B35,MATCH(0,(ISERROR(MID(B35,ROW(INDIRECT(\"1:\"&LEN(B35))),1)*1)*1),\n0),LEN(B35)-SUM((ISERROR(MID(B35,ROW(INDIRECT(\"1:\"&LEN(B35))),1)*1)*1)))\n)/(IF(NOT(ISERROR(SEARCH(\"double\",B35))),\"2\",\nIF(NOT(ISERROR(SEARCH(\"triple\",B35))),\"3\",\nIF(NOT(ISERROR(SEARCH(\"quadruple\",B35))),\"4\"))))","v":30},"j) ",{"$f":" (RANDBETWEEN(M35,N35)*12) & CHOOSE(INT(RAND()*3)+1,\" est le double de ?  \",\" est le triple de ?  \",\" est le quadruple de ?  \")","v":"120 est le quadruple de ?  "},"→",{"$f":"1*(MID(F35,MATCH(0,(ISERROR(MID(F35,ROW(INDIRECT(\"1:\"&LEN(F35))),1)*1)*1),\n0),LEN(F35)-SUM((ISERROR(MID(F35,ROW(INDIRECT(\"1:\"&LEN(F35))),1)*1)*1)))\n)/(IF(NOT(ISERROR(SEARCH(\"double\",F35))),\"2\",\nIF(NOT(ISERROR(SEARCH(\"triple\",F35))),\"3\",\nIF(NOT(ISERROR(SEARCH(\"quadruple\",F35))),\"4\"))))","v":30},5,5,null,null,10,10]
[]
[]
["E. Complète :",null,null,null,null,null,null,null,"Bornes",null,null,null,"Bornes"]
[null,null,null,null,null,null,null,null,"inf","sup",null,null,"inf","sup"]
[{"$f":"A4","v":"a) "},{"$f":"CHOOSE(INT(RAND()*3)+1,\"Quelle est la moitié de \",\"Quel est le tiers de \",\"Quel est le quart de \") & (RANDBETWEEN(I40,J40)*12) & \" ? \"","v":"Quel est le quart de 24 ? "},"→",{"$f":"(1*(MID(B40,MATCH(0,(ISERROR(MID(B40,ROW(INDIRECT(\"1:\"&LEN(B40))),1)*1)*1),\n0),LEN(B40)-SUM((ISERROR(MID(B40,ROW(INDIRECT(\"1:\"&LEN(B40))),1)*1)*1)))\n/(IF(NOT(ISERROR(SEARCH(\"moitié\",B40))),\"2\",\nIF(NOT(ISERROR(SEARCH(\"tiers\",B40))),\"3\",\nIF(NOT(ISERROR(SEARCH(\"quart\",B40))),\"4\"))))))","v":6},{"$f":"E4","v":"f) "},{"$f":"CHOOSE(INT(RAND()*3)+1,\"Quelle est la moitié de \",\"Quel est le tiers de \",\"Quel est le quart de \") & (RANDBETWEEN(M40,N40)*12) & \" ? \"","v":"Quel est le quart de 84 ? "},{"$f":"C40","v":"→"},{"$f":"(1*(MID(F40,MATCH(0,(ISERROR(MID(F40,ROW(INDIRECT(\"1:\"&LEN(F40))),1)*1)*1),\n0),LEN(F40)-SUM((ISERROR(MID(F40,ROW(INDIRECT(\"1:\"&LEN(F40))),1)*1)*1)))\n/(IF(NOT(ISERROR(SEARCH(\"moitié\",F40))),\"2\",\nIF(NOT(ISERROR(SEARCH(\"tiers\",F40))),\"3\",\nIF(NOT(ISERROR(SEARCH(\"quart\",F40))),\"4\"))))))","v":21},2,2,null,null,7,7]
["b) ",{"$f":"CHOOSE(INT(RAND()*3)+1,\"Quel est le double de \",\"Quel est le triple de \",\"Quel est le quadruple de \") & (RANDBETWEEN(I41,J41)*12) & \" ? \"","v":"Quel est le quadruple de 36 ? "},"→",{"$f":"(IF(NOT(ISERROR(SEARCH(\"double\",B41))),\"2\",\nIF(NOT(ISERROR(SEARCH(\"triple\",B41))),\"3\",\nIF(NOT(ISERROR(SEARCH(\"quadruple\",B41))),\"4\"))))*\n1*(MID(B41,MATCH(0,(ISERROR(MID(B41,ROW(INDIRECT(\"1:\"&LEN(B41))),1)*1)*1),\n0),LEN(B41)-SUM((ISERROR(MID(B41,ROW(INDIRECT(\"1:\"&LEN(B41))),1)*1)*1)))\n)","v":144},"g) ",{"$f":"CHOOSE(INT(RAND()*3)+1,\"Quel est le double de \",\"Quel est le triple de \",\"Quel est le quadruple de \") & (RANDBETWEEN(M41,N41)*12) & \" ? \"","v":"Quel est le double de 96 ? "},{"$f":"C41","v":"→"},{"$f":"(IF(NOT(ISERROR(SEARCH(\"double\",F41))),\"2\",\nIF(NOT(ISERROR(SEARCH(\"triple\",F41))),\"3\",\nIF(NOT(ISERROR(SEARCH(\"quadruple\",F41))),\"4\"))))*\n1*(MID(F41,MATCH(0,(ISERROR(MID(F41,ROW(INDIRECT(\"1:\"&LEN(F41))),1)*1)*1),\n0),LEN(F41)-SUM((ISERROR(MID(F41,ROW(INDIRECT(\"1:\"&LEN(F41))),1)*1)*1)))\n)","v":192},3,3,null,null,8,8]
["c) ",{"$f":" (RANDBETWEEN(I42,J42)*12) & CHOOSE(INT(RAND()*3)+1,\" est la moitié de ?  \",\" est le tiers de ?  \",\" est le quart de ?  \")","v":"48 est le tiers de ?  "},"→",{"$f":"(1*(MID(B42,MATCH(0,(ISERROR(MID(B42,ROW(INDIRECT(\"1:\"&LEN(B42))),1)*1)*1),\n0),LEN(B42)-SUM((ISERROR(MID(B42,ROW(INDIRECT(\"1:\"&LEN(B42))),1)*1)*1)))\n*(IF(NOT(ISERROR(SEARCH(\"moitié\",B42))),\"2\",\nIF(NOT(ISERROR(SEARCH(\"tiers\",B42))),\"3\",\nIF(NOT(ISERROR(SEARCH(\"quart\",B42))),\"4\"))))))","v":144},"h) ",{"$f":" (RANDBETWEEN(M42,N42)*12) & CHOOSE(INT(RAND()*3)+1,\" est la moitié de ?  \",\" est le tiers de ?  \",\" est le quart de ?  \")","v":"108 est le quart de ?  "},"→",{"$f":"(1*(MID(F42,MATCH(0,(ISERROR(MID(F42,ROW(INDIRECT(\"1:\"&LEN(F42))),1)*1)*1),\n0),LEN(F42)-SUM((ISERROR(MID(F42,ROW(INDIRECT(\"1:\"&LEN(F42))),1)*1)*1)))\n*(IF(NOT(ISERROR(SEARCH(\"moitié\",F42))),\"2\",\nIF(NOT(ISERROR(SEARCH(\"tiers\",F42))),\"3\",\nIF(NOT(ISERROR(SEARCH(\"quart\",F42))),\"4\"))))))","v":432},4,4,null,null,9,9]
["d) ",{"$f":" (RANDBETWEEN(I43,J43)*12) & CHOOSE(INT(RAND()*3)+1,\" est le double de ?  \",\" est le triple de ?  \",\" est le quadruple de ?  \")","v":"60 est le double de ?  "},"→",{"$f":"1*(MID(B43,MATCH(0,(ISERROR(MID(B43,ROW(INDIRECT(\"1:\"&LEN(B43))),1)*1)*1),\n0),LEN(B43)-SUM((ISERROR(MID(B43,ROW(INDIRECT(\"1:\"&LEN(B43))),1)*1)*1)))\n)/(IF(NOT(ISERROR(SEARCH(\"double\",B43))),\"2\",\nIF(NOT(ISERROR(SEARCH(\"triple\",B43))),\"3\",\nIF(NOT(ISERROR(SEARCH(\"quadruple\",B43))),\"4\"))))","v":30},"i) ",{"$f":" (RANDBETWEEN(M43,N43)*12) & CHOOSE(INT(RAND()*3)+1,\" est le double de ?  \",\" est le triple de ?  \",\" est le quadruple de ?  \")","v":"120 est le quadruple de ?  "},"→",{"$f":"1*(MID(F43,MATCH(0,(ISERROR(MID(F43,ROW(INDIRECT(\"1:\"&LEN(F43))),1)*1)*1),\n0),LEN(F43)-SUM((ISERROR(MID(F43,ROW(INDIRECT(\"1:\"&LEN(F43))),1)*1)*1)))\n)/(IF(NOT(ISERROR(SEARCH(\"double\",F43))),\"2\",\nIF(NOT(ISERROR(SEARCH(\"triple\",F43))),\"3\",\nIF(NOT(ISERROR(SEARCH(\"quadruple\",F43))),\"4\"))))","v":30},5,5,null,null,10,10]
["e) ",{"$f":" (RANDBETWEEN(I44,J44)*12) & CHOOSE(INT(RAND()*3)+1,\" est le double de ?  \",\" est le triple de ?  \",\" est le quadruple de ?  \")","v":"12 est le double de ?  "},"→",{"$f":"1*(MID(B44,MATCH(0,(ISERROR(MID(B44,ROW(INDIRECT(\"1:\"&LEN(B44))),1)*1)*1),\n0),LEN(B44)-SUM((ISERROR(MID(B44,ROW(INDIRECT(\"1:\"&LEN(B44))),1)*1)*1)))\n)/(IF(NOT(ISERROR(SEARCH(\"double\",B44))),\"2\",\nIF(NOT(ISERROR(SEARCH(\"triple\",B44))),\"3\",\nIF(NOT(ISERROR(SEARCH(\"quadruple\",B44))),\"4\"))))","v":6},"j) ",{"$f":" (RANDBETWEEN(M44,N44)*12) & CHOOSE(INT(RAND()*3)+1,\" est le double de ?  \",\" est le triple de ?  \",\" est le quadruple de ?  \")","v":"72 est le quadruple de ?  "},"→",{"$f":"1*(MID(F44,MATCH(0,(ISERROR(MID(F44,ROW(INDIRECT(\"1:\"&LEN(F44))),1)*1)*1),\n0),LEN(F44)-SUM((ISERROR(MID(F44,ROW(INDIRECT(\"1:\"&LEN(F44))),1)*1)*1)))\n)/(IF(NOT(ISERROR(SEARCH(\"double\",F44))),\"2\",\nIF(NOT(ISERROR(SEARCH(\"triple\",F44))),\"3\",\nIF(NOT(ISERROR(SEARCH(\"quadruple\",F44))),\"4\"))))","v":18},1,1,null,null,6,6]
[{"$f":"A1","v":"SAVOIR UTILISER LES MOTS  MOITIE / DOUBLE - TIERS / TRIPLE - QUART / QUADRUPLE"},0,0,0,0,0,0,0]
[{"$f":"$A$2","v":"A. Complète :"}]
[]
["a) ","Quelle est la moitié de 120 ? ","→","…………………","f) ","Quelle est la moitié de 12 ? ","→","…………………"]
["b) ","Quel est le double de 96 ? ","→","…………………","g) ","Quel est le triple de 48 ? ","→","…………………"]
["c) ","72 est le tiers de ?  ","→","…………………","h) ","60 est le tiers de ?  ","→","…………………"]
["d) ","72 est le double de ?  ","→","…………………","i) ","96 est le double de ?  ","→","…………………"]
["e) ","48 est le double de ?  ","→","…………………","j) ","108 est le double de ?  ","→","…………………"]
[]
[]
[{"$f":"A11","v":"B. Complète :"},0,0,0]
[]
["a) ","Quelle est la moitié de 24 ? ","→","…………………","f) ","Quelle est la moitié de 120 ? ","→","…………………"]
["b) ","Quel est le triple de 48 ? ","→","…………………","g) ","Quel est le triple de 84 ? ","→","…………………"]
["c) ","60 est le tiers de ?  ","→","…………………","h) ","72 est la moitié de ?  ","→","…………………"]
["d) ","96 est le double de ?  ","→","…………………","i) ","60 est le quadruple de ?  ","→","…………………"]
["e) ","108 est le triple de ?  ","→","…………………","j) ","60 est le double de ?  ","→","…………………"]
[]
[]
["C. Complète :",0,0,0]
[]
[{"$f":"A22","v":"a) "},"Quel est le tiers de 108 ? ","→","…………………","f) ","Quelle est la moitié de 72 ? ","→","…………………"]
["b) ","Quel est le double de 48 ? ","→","…………………","g) ","Quel est le double de 96 ? ","→","…………………"]
["c) ","72 est la moitié de ?  ","→","…………………","h) ","84 est le tiers de ?  ","→","…………………"]
["d) ","36 est le triple de ?  ","→","…………………","i) ","72 est le quadruple de ?  ","→","…………………"]
["e) ","72 est le double de ?  ","→","…………………","j) ","60 est le triple de ?  ","→","…………………"]
[]
[]
["D. Complète :",0,0,0]
[]
[{"$f":"A31","v":"a) "},"Quel est le quart de 12 ? ","→","…………………","f) ","Quel est le quart de 72 ? ","→","…………………"]
["b) ","Quel est le quadruple de 24 ? ","→","…………………","g) ","Quel est le quadruple de 84 ? ","→","…………………"]
["c) ","36 est le quart de ?  ","→","…………………","h) ","96 est le quart de ?  ","→","…………………"]
["d) ","48 est le triple de ?  ","→","…………………","i) ","108 est le double de ?  ","→","…………………"]
["e) ","60 est le double de ?  ","→","…………………","j) ","120 est le quadruple de ?  ","→","…………………"]
[]
[]
["E. Complète :",0,0,0]
[]
["a) ","Quel est le quart de 24 ? ","→","…………………","f) ","Quel est le quart de 84 ? ","→","…………………"]
["b) ","Quel est le quadruple de 36 ? ","→","…………………","g) ","Quel est le double de 96 ? ","→","…………………"]
["c) ","48 est le tiers de ?  ","→","…………………","h) ","108 est le quart de ?  ","→","…………………"]
["d) ","60 est le double de ?  ","→","…………………","i) ","120 est le quadruple de ?  ","→","…………………"]
["e) ","12 est le double de ?  ","→","…………………","j) ","72 est le quadruple de ?  ","→","…………………"]